program: Gaussian 09
title: 000191555
version: EM64L-G09RevD.01
frameworkgroup: C1[X(C18H22O3)]
method: RPBEPBE
basis: SDD
operation: Freq
keyword: #pfreq=noraman
keyword: PBEPBE/SDD
title: #p freq=noraman PBEPBE/SDD
converged: NO YES NO NO
title: Mulliken charges:
elementType: O O O C C C C C C C C C C C C C C C C C C H H H H H H H H H H H H H H H H H H H H H H
charge: -0.185714 -0.208052 -0.222047 -0.226723 0.265618 -0.098415 -0.098236 -0.503998 -0.502341 -0.508545 0.088619 -0.540389 -0.765312 -0.521992 0.151393 -0.537988 -0.285232 -0.491570 0.209357 0.199866 -0.461405 0.239402 0.253280 0.209743 0.201893 0.247704 0.229993 0.225715 0.247447 0.210422 0.260447 0.255670 0.221699 0.240907 0.226283 0.256336 0.209354 0.244159 0.242216 0.254923 0.241954 0.270091 0.253467
chargesum: 0.00000
title: Mulliken charges with hydrogens summed into heavy atoms:
elementType: O O O C C C C C C C C C C C C C C C C C C
charge: -0.185714 -0.208052 -0.222047 0.012679 0.265618 0.154865 0.111507 -0.054401 -0.046632 -0.050676 0.088619 -0.024271 -0.076424 -0.056302 0.151393 -0.051614 -0.030309 0.020476 0.209357 0.199866 -0.207938
polarizability: 2.68446318e+02 9.10168451e+00 1.73026703e+02 2.75889609e+00 -7.36702359e-01 1.48567849e+02
1716.lowfreq: -14.9415 -6.2716 -0.0008 -0.0007 -0.0004 9.3950 34.3926 49.5823 57.0998
frequency: 34.2131 49.3470 57.0442 77.2768 88.9377 127.2019 136.5672 162.5058 172.5343 188.3488 222.3830 224.9519 230.0889 242.4091 260.4162 273.2030 281.1839 298.1710 322.1376 358.6678 385.7256 403.6091 444.6516 465.3926 477.4479 492.0708 513.5008 534.7279 552.1508 559.1134 583.2707 599.6079 610.5361 641.9813 687.0699 700.2518 740.7138 782.7215 787.5645 831.2282 837.7153 851.3100 864.3947 884.2981 900.6299 909.2078 934.1692 940.0527 957.8947 965.3398 991.6217 1004.3475 1013.2615 1019.8530 1033.6007 1044.2682 1067.6394 1072.0854 1082.8936 1093.5184 1100.3227 1111.5989 1134.0378 1150.1011 1158.0977 1166.8216 1188.6801 1194.3584 1209.8235 1228.3916 1236.5630 1241.5872 1258.8120 1266.5313 1273.8685 1275.0782 1284.3298 1296.5978 1307.9454 1314.6505 1322.0378 1325.8503 1332.2264 1336.4267 1345.1620 1349.1179 1383.4330 1390.7875 1430.7430 1431.8191 1436.9383 1456.5818 1460.6707 1469.6839 1472.1590 1475.9321 1492.6313 1567.1174 1617.1943 1652.8546 1974.9654 2964.5743 2967.6974 2969.3183 2974.0162 2977.9648 2979.1109 2985.7730 2992.8061 3001.2672 3002.1795 3020.6256 3033.6774 3048.5274 3053.5934 3061.4201 3068.2988 3071.0718 3075.1172 3078.4506 3083.5981 3083.9812 3093.8166
redmass: 6.8275 4.0338 6.8895 5.2711 4.7268 3.5654 3.8048 3.4116 3.8172 3.0732 1.6872 2.3339 1.9198 2.7820 3.1327 3.5044 3.0901 2.5275 2.5737 3.1302 2.8773 3.5215 4.2895 3.9396 3.1359 3.4679 2.6511 3.1780 3.4579 2.4924 3.4388 3.7575 3.2957 4.4692 3.2946 2.9021 3.4210 1.9650 2.0378 2.2757 2.5163 2.3119 2.2305 2.3934 2.1342 1.4268 2.1184 2.1619 1.8983 2.3802 2.0158 1.8093 2.6455 3.0534 2.2019 2.3240 2.2775 2.0597 2.4508 2.4981 1.7196 2.1874 1.5843 1.8205 1.5441 1.4076 1.6308 1.5004 1.3922 1.6556 1.6127 1.3105 1.4859 1.8264 1.3576 1.3590 1.5991 1.3300 1.4876 1.3379 1.3569 1.3932 1.5988 1.3305 1.4752 1.4721 1.2065 2.6491 1.0772 1.0738 1.0923 1.0803 1.0930 1.0669 1.0836 1.0601 1.0748 9.0974 7.6833 11.6451 10.5955 1.0658 1.0678 1.0803 1.0606 1.0758 1.0414 1.0630 1.0810 1.0639 1.0660 1.0638 1.0992 1.1031 1.0920 1.0975 1.0915 1.0929 1.1006 1.1011 1.0955 1.0997 1.0878
irintensity: 3.5170 1.5261 1.4638 0.5332 4.4084 6.5224 1.5421 1.9284 1.6723 1.0500 0.7523 0.8585 1.3627 3.6099 2.5039 1.3341 0.2833 1.7782 5.6349 0.6709 11.0530 5.7297 6.5806 2.4156 4.2771 2.0944 4.6875 2.2592 7.9152 1.5856 0.5698 0.4462 15.9539 0.2647 1.7006 10.6235 14.6108 11.6997 1.9212 0.4788 5.1059 4.5203 1.0518 16.0381 28.7441 17.0268 5.5978 7.0573 0.3942 9.6943 15.6900 25.9410 9.1195 13.3220 1.8937 12.9122 8.2059 19.8245 8.1039 3.8361 20.2696 23.3273 21.9445 13.9411 3.0580 8.7010 0.5920 75.3827 15.5881 5.8958 3.8358 0.9136 5.1035 41.2533 3.7586 5.0243 12.2815 12.4754 3.7129 4.9484 2.6166 8.3462 27.6307 5.1312 6.5230 10.4283 14.0032 12.4085 24.9253 21.1500 29.4556 9.1962 18.9989 5.5357 13.1681 5.8572 25.2791 275.3127 59.5956 149.9755 119.6631 24.0107 5.2577 3.1558 17.2762 4.3532 36.3202 24.0055 39.3575 18.8711 32.3228 38.5685 14.8267 30.5245 18.9322 7.7327 3.1463 9.3373 21.7836 50.6595 7.8720 21.4512 0.5671
temp: 298.150 k
press: 1.00000 atm
elementType: 8 8 8 6 6 6 6 6 6 6 6 6 6 6 6 6 6 6 6 6 6 1 1 1 1 1 1 1 1 1 1 1 1 1 1 1 1 1 1 1 1 1 1
symmnumber: 1
zpe: 937743.3 jmol-1
zpe.correction: 0.357168 hartree
zpe.thermalcorrener: 0.376718 hartree
zpe.thermalcorrenthalpy: 0.377662 hartree
zpe.thermalcorrgfe: 0.310001 hartree
zpe.sumelectzpe: -923.159526 hartree
zpe.sumelectthermal: -923.139976 hartree
zpe.sumelectthermalent: -923.139032 hartree
zpe.sumelectthermalfe: -923.206693 hartree
dipole: 3.7340 2.1832 3.3920
dipole: 5.4968
quadrupole: -166.8620 -120.0014 -126.4511
quadrupole: 12.8344 3.7819 -5.7715
quadrupole: -29.0905 17.7701 11.3204 12.8344 3.7819 -5.7715
hfenergy: -923.516694 hartree
pointgroup: C01 [X(C18H22O3)]
dipole: -1.3986661 -1.2025327 1.1289659 debye
polarizability: 267.9185841|10.3807417|170.8424543|-7.1401038|6.5375881|151.2798319 unknown
InChI: InChI=1S/C18H22O3/c1-18-11-10-14-13(15(18)7-9-17(18)21)5-3-2-4-12(19)6-8-16(14)20/h3-4,13-15H,5-11H2,1H3
charge 0 multiplicity 1
43 atoms
O  -4.382632 1.515511 -0.392956
O  1.417318 1.291477 -1.596512
O  5.954577 -0.031954 -0.296813
C  -1.894132 -1.078377 0.179437
C  -2.800887 0.02712 0.824342
C  -0.644954 -0.513237 -0.564282
C  0.082694 0.553917 0.30314
C  -2.068334 1.245443 1.43747
C  -2.863564 -1.794164 -0.823742
C  -0.882483 1.740733 0.586945
C  -3.731578 0.444693 -0.343621
C  -3.744801 -0.660897 -1.407067
C  -3.733187 -0.596224 1.911764
C  0.331742 -1.652219 -1.029101
C  1.369051 1.055959 -0.357262
C  2.575827 1.33946 0.552631
C  1.428346 -1.940593 -0.007494
C  3.935568 1.294336 -0.181249
C  2.708034 -1.645093 -0.216177
C  4.687494 -0.039148 -0.272028
C  3.99107 -1.356108 -0.455736
H  -1.548728 -1.78333 0.962974
H  -0.985608 0.005789 -1.483693
H  0.349996 0.104194 1.280883
H  -1.70155 0.978151 2.449145
H  -2.809685 2.058425 1.56029
H  -3.489396 -2.532255 -0.290798
H  -2.320316 -2.343736 -1.611297
H  -1.232406 2.165265 -0.373832
H  -0.357429 2.552555 1.126417
H  -4.780346 -0.960925 -1.645409
H  -3.319983 -0.24174 -2.339944
H  -3.120736 -0.996428 2.740784
H  -4.410472 0.175663 2.318685
H  -4.354918 -1.4204 1.518581
H  0.805951 -1.355124 -1.978938
H  -0.241826 -2.579213 -1.220846
H  2.42998 2.369737 0.943461
H  2.552575 0.675849 1.43482
H  1.124131 -2.3475 0.969217
H  4.65006 2.011999 0.25664
H  3.751972 1.620504 -1.227809
H  4.667564 -2.146017 -0.81502
