program: Gaussian 09
title: 000191477
version: EM64L-G09RevD.01
frameworkgroup: C1[X(C12H10N2O3S)]
method: RPBEPBE
basis: SDD
operation: Freq
keyword: #p
keyword: freq=noraman
keyword: PBEPBE/SDD
title: #p freq=noraman PBEPBE/SDD
converged: YES YES NO NO
title: Mulliken charges:
elementType: S O O O N N C C C C C C C C C C C C H H H H H H H H H H
charge: 0.153666 -0.199516 -0.218529 -0.281642 -0.430618 0.317547 -0.163621 -0.443964 -0.312171 0.183776 0.172075 0.281578 -0.321665 -0.323732 -0.385847 -0.397592 0.497986 -0.790726 0.289968 0.240417 0.281511 0.234037 0.245519 0.340433 0.282859 0.227992 0.260483 0.259774
chargesum: 0.00000
title: Mulliken charges with hydrogens summed into heavy atoms:
elementType: S O O O N N C C C C C C C C C C C C
charge: 0.153666 -0.199516 -0.218529 -0.281642 -0.090185 0.317547 0.126346 0.077965 0.167386 0.183776 0.172075 0.281578 -0.038806 -0.095740 -0.125364 -0.137818 0.497986 -0.790726
polarizability: 3.58215657e+02 2.77187804e+01 1.42237306e+02 1.49438084e+00 -6.91854518e+00 8.43094887e+01
1716.lowfreq: 0.0005 0.0011 0.0027 1.6520 2.3069 13.2893 20.8558 26.7464 32.7137
frequency: 20.8428 26.7189 32.5444 57.9742 64.8254 77.9261 129.3454 145.8661 191.4256 194.1337 218.5337 270.8565 306.3404 361.2094 387.4274 405.0975 417.7447 433.6086 441.7200 484.4232 500.6200 524.9156 566.7212 592.2001 633.1463 635.7105 673.6227 683.8494 691.6904 761.6690 771.9319 832.7940 850.6904 865.2602 883.2160 906.5451 910.3677 962.6023 968.1206 995.2131 997.3132 1006.8709 1072.2459 1096.0670 1112.6298 1116.8459 1147.5289 1179.5305 1185.1897 1201.4892 1230.8486 1276.5562 1284.4410 1291.9583 1307.0407 1329.1445 1350.9905 1355.9640 1419.5628 1471.5007 1475.3297 1483.5020 1505.6888 1546.2078 1588.8050 1614.4396 1697.0828 2191.1092 2955.5101 3034.1512 3038.4759 3118.8832 3130.0124 3137.2990 3154.9697 3169.1991 3174.5381 3505.4054
redmass: 12.3282 6.1825 4.5967 5.8727 9.1886 6.5377 4.9472 6.0647 6.7284 4.4367 3.5346 10.8801 7.1710 8.5798 6.2375 2.9739 4.3269 8.5833 6.8808 5.8279 5.9831 3.3806 1.4594 3.2795 4.7806 4.4325 5.4920 4.8234 6.0737 4.2898 5.6539 1.3396 2.0434 1.6154 2.9375 5.6729 4.2968 1.4231 2.5885 1.3886 3.1846 2.6291 2.3377 2.5311 3.7332 1.4191 1.3338 1.2845 1.2459 2.4087 1.3956 3.4124 1.3162 2.1347 1.4202 1.3208 1.5257 5.1565 3.9057 2.1288 1.0897 1.0936 2.6671 7.7645 7.8274 6.2738 11.9484 12.8810 1.0810 1.0639 1.0630 1.1025 1.1059 1.0888 1.0886 1.0960 1.0977 1.0773
irintensity: 0.1037 0.2528 1.5454 0.6471 8.6413 8.9505 1.0566 9.5115 3.5330 6.3748 16.5011 1.4542 0.5852 1.6149 1.3588 0.8094 4.5369 1.6833 10.7229 21.3749 3.9510 10.6800 74.5862 25.2340 2.7991 2.2642 10.9633 16.6544 9.4865 15.6119 30.6140 12.0381 32.2121 49.9979 19.5873 50.6566 31.2876 2.0655 21.8558 2.5280 23.3859 6.3711 30.4572 2.4288 233.4816 12.0401 13.0322 44.4259 9.3201 2.9321 12.9025 5.1616 2.7890 200.7291 49.7924 1.5995 3.9170 0.9097 3.4505 474.8605 29.9849 7.8975 78.0593 60.5254 148.9877 137.8828 236.7230 1661.9120 24.9338 40.6859 14.9655 9.0461 15.0933 14.8288 1.1639 5.2912 3.1995 54.7566
temp: 298.150 k
press: 1.00000 atm
elementType: 16 8 8 8 7 7 6 6 6 6 6 6 6 6 6 6 6 6 1 1 1 1 1 1 1 1 1 1
symmnumber: 1
zpe: 531344.0 jmol-1
zpe.correction: 0.202378 hartree
zpe.thermalcorrener: 0.218645 hartree
zpe.thermalcorrenthalpy: 0.219589 hartree
zpe.thermalcorrgfe: 0.154993 hartree
zpe.sumelectzpe: -1195.253944 hartree
zpe.sumelectthermal: -1195.237677 hartree
zpe.sumelectthermalent: -1195.236733 hartree
zpe.sumelectthermalfe: -1195.301329 hartree
dipole: 2.4956 1.7168 1.4961
dipole: 3.3784
quadrupole: -123.5257 -120.3096 -110.1739
quadrupole: 12.3998 8.1908 -4.2415
quadrupole: -5.5227 -2.3065 7.8292 12.3998 8.1908 -4.2415
hfenergy: -1195.4563221 hartree
pointgroup: C01 [X(C12H10N2O3S1)]
dipole: 0.9334245 0.3454126 0.8809821 debye
polarizability: 354.8358598|29.3382806|136.6335358|25.6535464|22.0949725|93.2930569 unknown
InChI: InChI=1S/C12H10N2O3S/c15-11(14-10-5-6-17-12(10)16)8-1-3-9(4-2-8)13-7-18/h1-4,10,14H,5-6H2
charge 0 multiplicity 1
28 atoms
S  -7.515245 -0.89388 -0.482776
O  5.246234 -0.904364 -0.129247
O  3.605249 -1.563537 -1.646033
O  1.164099 2.014697 0.813663
N  1.759629 -0.027858 -0.098505
N  -4.746853 -0.340806 -0.218584
C  3.178297 0.304146 -0.043801
C  3.838521 0.399369 1.352957
C  5.310865 0.069739 1.022145
C  3.987548 -0.815126 -0.729972
C  0.811506 0.893075 0.322128
C  -0.633485 0.50781 0.169865
C  -1.599274 1.538258 0.310571
C  -1.075218 -0.817577 -0.087151
C  -2.970448 1.266759 0.180639
C  -2.445173 -1.107259 -0.216588
C  -3.40363 -0.062873 -0.089062
C  -5.926179 -0.575188 -0.330909
H  3.363348 1.257324 -0.584935
H  3.40247 -0.363287 2.021575
H  3.707607 1.390766 1.810119
H  5.880658 0.949255 0.674723
H  5.858707 -0.442945 1.825759
H  1.507979 -0.833094 -0.680259
H  -1.242705 2.550074 0.527438
H  -0.36277 -1.646979 -0.160073
H  -3.714096 2.06257 0.283984
H  -2.786945 -2.128569 -0.408672
