program: Gaussian 09
title: 000191502
version: EM64L-G09RevD.01
frameworkgroup: C1[X(C11H18N3O8P)]
method: RPBEPBE
basis: SDD
operation: Freq
keyword: #p
keyword: freq=noraman
keyword: PBEPBE/SDD
title: #p freq=noraman PBEPBE/SDD
converged: YES YES NO NO
title: Mulliken charges:
elementType: P O O O O O O O O N N N C C C C C C C C C C C H H H H H H H H H H H H H H H H H H
charge: 1.387903 -0.431052 -0.334354 -0.429550 -0.489913 -0.280107 -0.672842 -0.718489 -0.592719 -0.216215 -0.039569 -0.619176 -0.109670 -0.174805 -0.000970 -0.022723 -0.325591 -0.223508 -0.091136 0.050646 -0.357025 -0.678893 0.193162 0.285897 0.241297 0.271895 0.305586 0.225084 0.264975 0.367827 0.262240 0.203226 0.334759 0.236144 0.219263 0.220323 0.230291 0.343489 0.322355 0.439692 0.402254
chargesum: 0.00000
title: Mulliken charges with hydrogens summed into heavy atoms:
elementType: P O O O O O O O O N N N C C C C C C C C C C C
charge: 1.387903 -0.431052 -0.334354 -0.061723 -0.489913 -0.280107 -0.233150 -0.316236 -0.592719 -0.216215 -0.039569 0.046668 0.176227 0.066492 0.270924 0.282863 0.164469 0.241958 0.243623 0.050646 -0.120880 -0.009017 0.193162
polarizability: 2.12960478e+02 -5.61413244e+00 2.35472983e+02 -7.90933636e+00 1.31836245e+01 1.34140439e+02
1716.lowfreq: -8.3720 0.0004 0.0006 0.0007 5.8204 10.0598 24.8235 41.9269 44.3862
frequency: 24.7976 41.8104 44.3327 51.8839 52.6464 64.5589 73.0146 89.5970 107.4470 129.6494 155.1562 166.4011 175.1314 196.0158 201.9134 215.7415 231.4248 234.1697 246.7683 264.0712 281.0557 310.7025 314.9030 326.8179 339.2178 344.7598 353.9134 375.4157 412.9160 429.9807 447.6930 452.6840 506.0563 529.8515 553.6879 565.5510 572.9540 575.5071 583.5444 599.3044 648.7842 665.5733 695.9582 717.0275 739.6271 749.1976 773.5354 783.1960 798.3278 798.8291 806.0467 825.7626 857.5314 899.4968 922.9486 941.2194 959.9122 988.7168 998.8615 1007.8384 1012.1716 1024.3878 1028.1042 1044.7059 1051.6352 1065.5884 1084.7854 1091.4143 1113.9370 1115.9372 1140.0828 1173.0699 1194.9707 1211.6510 1223.6367 1237.0941 1247.6524 1256.2759 1259.3497 1272.7407 1278.7819 1311.5194 1319.9404 1338.0008 1346.3117 1368.8476 1371.5458 1375.4846 1393.4346 1404.8567 1441.7087 1462.4143 1474.4420 1479.7331 1498.4697 1506.6456 1584.0514 1629.2453 1637.9139 2975.2865 2994.1012 3000.8707 3013.0968 3034.1544 3047.7998 3054.1802 3059.3782 3062.5038 3092.7696 3093.1646 3101.3888 3155.5187 3187.7706 3417.0429 3540.4934 3596.0685 3697.4148
redmass: 5.8905 4.9455 5.9640 4.1056 4.1470 4.7209 5.9043 2.7128 4.9915 6.5339 7.2530 3.0448 4.4583 6.8050 7.2926 5.7301 1.9590 1.2843 4.1401 7.1398 6.2060 3.0476 3.9214 6.4850 8.2054 4.4776 4.2155 3.9240 5.0857 3.1929 4.1040 1.1879 3.5402 5.1673 3.2422 1.8234 3.1943 1.2422 5.9746 7.5663 4.3135 9.0863 3.2352 5.4693 6.6723 7.1115 3.2055 1.9883 4.3777 1.3419 1.1256 3.5831 3.0520 3.5760 3.6089 3.5896 6.3658 1.3693 1.3669 3.3548 2.4300 2.2256 3.2260 3.0454 3.3520 3.2354 3.9175 3.9115 2.3613 2.4252 1.4790 1.8290 1.5308 2.8341 1.3749 1.1951 1.4425 1.1783 1.3530 1.2629 1.3057 1.3061 1.2682 1.3796 1.3369 1.3133 1.6857 1.4528 1.2309 1.3356 1.0846 1.0404 4.2594 1.0830 1.0839 4.4616 2.8329 1.8393 6.7202 1.0632 1.0365 1.0678 1.0608 1.0856 1.0873 1.0868 1.1010 1.0877 1.0988 1.1048 1.1017 1.0932 1.0976 1.0640 1.0454 1.0661 1.1045
irintensity: 1.8368 0.3401 3.9544 4.8072 3.7614 1.2080 1.2206 1.0164 6.4949 1.6929 6.7075 44.6053 6.7863 5.7587 8.1168 6.3360 45.2622 0.3307 1.5586 3.8510 4.6146 37.6583 6.8030 4.3180 37.2196 6.7266 11.2611 4.1588 1.8096 5.5369 5.4600 136.9540 24.2270 3.5723 16.1076 87.3697 30.5258 151.2726 11.6229 14.0771 8.6742 141.4637 1.9103 21.8759 9.4991 22.7679 34.6143 117.3653 83.2461 107.6009 10.7621 50.8807 12.2052 85.5695 7.7922 201.5648 94.5573 7.0429 18.1719 58.6405 15.4369 29.4474 97.2569 79.6442 109.4380 89.3768 55.5672 143.6387 5.1973 1.8752 7.3829 24.9964 16.2452 21.6644 50.0349 3.8347 26.6448 36.3905 71.1358 243.9741 2.3712 9.0304 16.2262 37.7557 3.2251 20.1952 18.0066 63.2945 22.1401 16.4389 13.8270 12.1875 200.1823 2.4834 13.4013 107.5238 195.1728 141.5382 889.7507 45.1361 34.1247 891.7562 83.6147 11.0709 9.0500 36.1271 1.6780 6.8307 22.7231 10.1359 35.8175 40.8797 4.7518 63.0736 125.7448 60.0191 40.6941
temp: 298.150 k
press: 1.00000 atm
elementType: 15 8 8 8 8 8 8 8 8 7 7 7 6 6 6 6 6 6 6 6 6 6 6 1 1 1 1 1 1 1 1 1 1 1 1 1 1 1 1 1 1
symmnumber: 1
zpe: 809973.4 jmol-1
zpe.correction: 0.308503 hartree
zpe.thermalcorrener: 0.332566 hartree
zpe.thermalcorrenthalpy: 0.333510 hartree
zpe.thermalcorrgfe: 0.254185 hartree
zpe.sumelectzpe: -1535.448027 hartree
zpe.sumelectthermal: -1535.423963 hartree
zpe.sumelectthermalent: -1535.423019 hartree
zpe.sumelectthermalfe: -1535.502345 hartree
dipole: 3.7674 3.8102 4.2931
dipole: 6.8660
quadrupole: -182.9997 -105.4680 -150.8648
quadrupole: -11.0449 -10.7247 14.7694
quadrupole: -36.5555 40.9762 -4.4207 -11.0449 -10.7247 14.7694
hfenergy: -1535.7565296 hartree
pointgroup: C01 [X(C11H18N3O8P1)]
dipole: 0.9553798 -1.2196253 -2.2128573 debye
polarizability: 212.2286718|11.1721838|229.5034839|-10.8330604|25.4510836|140.8417433 unknown
InChI: InChI=1S/C11H18N3O8P/c1-2-20-9-8(15)6(5-21-23(17,18)19)22-10(9)14-4-3-7(12)13-11(14)16/h3-4,6,8-10,15,17-18H,2,5,12H2,1H3
charge 0 multiplicity 1
41 atoms
P  -3.830822 -0.158544 1.375128
O  -0.766737 0.627165 0.533734
O  1.529409 2.72259 -0.132741
O  -0.358503 3.394514 -1.856394
O  -3.715854 1.343096 0.498104
O  3.10132 -0.543198 -0.21723
O  -2.439184 -0.240698 2.328032
O  -3.491996 -1.321351 0.102499
O  -5.206075 -0.366619 2.113966
N  0.805772 -0.937615 -0.414435
N  2.419379 -2.623385 -1.086427
N  1.6954 -4.660556 -1.925281
C  0.993507 1.558313 -0.832054
C  -0.38169 2.026377 -1.390517
C  -1.345865 1.810378 -0.193707
C  0.641119 0.423399 0.168637
C  -2.773681 1.497457 -0.632153
C  3.017724 2.724803 0.00294
C  -0.247039 -1.775719 -0.721555
C  2.199773 -1.366183 -0.567681
C  -0.003253 -3.035747 -1.234753
C  3.387322 3.922405 0.871128
C  1.378363 -3.425727 -1.412963
H  1.687522 1.206766 -1.615176
H  -0.683011 1.401406 -2.25041
H  -1.314575 2.676264 0.491752
H  1.276565 0.491301 1.067316
H  -2.799504 0.594082 -1.270394
H  -3.162889 2.363927 -1.193867
H  0.31314 3.859542 -1.27908
H  3.336958 1.762872 0.442158
H  3.455696 2.802075 -1.013437
H  -1.261362 -1.420257 -0.516615
H  -0.833911 -3.704008 -1.468076
H  4.484994 3.973036 0.987566
H  3.044375 4.867815 0.415106
H  2.9362 3.834306 1.87437
H  2.68208 -4.89786 -2.01897
H  0.981391 -5.333148 -2.190966
H  -1.604484 0.070614 1.823715
H  -4.237973 -1.956691 -0.044368
