program: Gaussian 09
title: 000191431
version: EM64L-G09RevD.01
frameworkgroup: C1[X(C11H8Cl2N2S)]
method: RPBEPBE
basis: SDD
operation: Freq
keyword: #p
keyword: freq=noraman
keyword: PBEPBE/SDD
title: #p freq=noraman PBEPBE/SDD
converged: YES YES NO NO
title: Mulliken charges:
elementType: Cl Cl S N N C C C C C C C C C C C H H H H H H H H
charge: -0.019702 -0.019777 0.263766 -0.192206 -0.050451 -0.362742 -0.483186 -0.126431 -0.099791 -0.215425 0.545122 -0.282949 -0.282931 -0.232990 -0.232999 -0.205984 0.239637 0.239627 0.235390 0.235385 0.277145 0.264070 0.264070 0.243352
chargesum: 0.00000
title: Mulliken charges with hydrogens summed into heavy atoms:
elementType: Cl Cl S N N C C C C C C C C C C C
charge: -0.019702 -0.019777 0.263766 -0.192206 -0.050451 0.116522 -0.012411 -0.126431 0.177354 -0.215425 0.545122 -0.282949 -0.282931 0.031080 0.031071 0.037368
polarizability: 2.42254856e+02 1.19441338e-02 1.50328005e+02 -4.37499170e+00 -4.11952265e-02 1.08065372e+02
1716.lowfreq: -19.8480 -0.0015 -0.0013 0.0005 4.2739 6.2399 8.4442 38.3731 53.5691
frequency: -19.8377 38.3302 53.5624 84.2090 111.5124 113.4681 157.6998 189.3362 194.2950 263.1760 289.3940 292.9868 381.0604 391.1994 403.7703 440.2255 490.6016 510.3119 523.6763 553.6609 589.4081 597.3884 646.7276 721.1702 737.0268 740.6342 779.9509 782.2851 814.4948 817.0449 893.6403 896.2874 901.7222 936.9712 972.2361 1012.8933 1065.2762 1065.9410 1069.0549 1145.0189 1152.3466 1169.4417 1185.8092 1206.4665 1210.7648 1233.9277 1290.7345 1334.8949 1339.5326 1368.0858 1411.4533 1438.6927 1469.0888 1493.3005 1552.1050 1572.7922 1586.6620 1638.0559 2991.2319 3014.9268 3042.5148 3072.6330 3151.3783 3173.2327 3183.8922 3205.6470
redmass: 7.7202 8.7606 7.1677 1.9724 11.1048 7.5218 16.6033 4.6154 4.2613 14.1574 7.7163 6.2199 6.8131 7.0752 11.7561 5.7167 9.3137 4.8959 5.3173 5.4138 6.5412 4.9482 7.5126 6.4015 9.0319 3.1837 5.5735 1.7799 1.3824 1.1937 1.3638 7.2539 3.9119 6.2148 1.3345 6.5978 3.5175 1.6038 3.0819 2.6793 1.5652 1.1245 1.3479 1.0815 3.1747 1.4142 1.2875 1.7934 8.4170 4.9998 2.2464 3.8714 1.1349 1.0891 6.6095 7.1322 7.9918 8.6421 1.0568 1.0595 1.1093 1.1077 1.0876 1.0931 1.0996 1.0974
irintensity: 3.6066 0.1659 1.5619 0.0400 0.7937 0.4749 0.8517 0.4084 7.7205 0.0716 0.0025 3.5836 5.4005 3.5226 8.0899 0.0125 23.0396 0.0920 0.0083 11.9062 9.1559 2.7152 9.2852 1.3684 90.0225 17.0286 11.2749 43.9390 12.7025 0.0268 0.0023 15.8229 1.7822 14.6728 0.6244 3.5478 7.2802 0.0044 8.6653 16.9816 11.9120 1.1774 14.2422 0.2407 16.4640 60.3237 58.1082 9.7582 6.4243 85.8588 70.5090 2.7410 4.8063 4.4502 44.8236 222.6179 194.5055 134.8937 44.1298 103.2011 5.0867 41.1558 4.6392 0.7288 7.3945 3.4334
temp: 298.150 k
press: 1.00000 atm
elementType: 17 17 16 7 7 6 6 6 6 6 6 6 6 6 6 6 1 1 1 1 1 1 1 1
symmnumber: 1
zpe: 431596.3 jmol-1
zpe.correction: 0.164386 hartree
zpe.thermalcorrener: 0.177921 hartree
zpe.thermalcorrenthalpy: 0.178866 hartree
zpe.thermalcorrgfe: 0.122511 hartree
zpe.sumelectzpe: -1850.485891 hartree
zpe.sumelectthermal: -1850.472355 hartree
zpe.sumelectthermalent: -1850.471411 hartree
zpe.sumelectthermalfe: -1850.527766 hartree
dipole: -2.3579 0.0137 -4.3999
dipole: 4.9919
quadrupole: -93.6260 -116.3037 -114.9388
quadrupole: 0.0442 -14.9935 -0.0034
quadrupole: 14.6635 -8.0142 -6.6493 0.0442 -14.9935 -0.0034
hfenergy: -1850.6502768 hartree
pointgroup: C01 [X(C11H8Cl2N2S1)]
dipole: -0.9221464 -0.0179732 1.7339183 debye
dipolederiv: -0.2253152 -0.2515027 -0.0058774 -0.1953358 -0.6501939 -0.0121416 0.0024937 -0.0124518 -0.0455045 -0.2235247 0.2499937 -0.0011456 0.1934944 -0.6521944 0.0007961 0.006151 0.0012234 -0.0452756 -0.5658742 0.000386 0.0857494 0.0050497 0.0788984 0.0010182 -0.2921564 0.0016959 -0.0218355 -1.3457462 0.0064292 -0.3347567 -0.0064104 -0.1345149 0.005599 0.8015864 0.002946 -0.5454219 -1.4734067 0.0014772 0.0778889 -0.0009921 -0.33235 0.0005096 0.305553 -0.0000128 -0.3936869 0.274502 -0.0038505 0.3473942 -0.0025726 0.3188856 0.001035 0.2437602 0.0012372 0.1685286 0.4262209 -0.0010365 0.0586896 -0.0027091 0.2606371 0.0004648 0.1875501 0.000202 0.2128044 1.6754373 -0.0019459 -0.12136 0.0030086 0.0318567 -0.0055123 -0.5212227 -0.0044907 0.5219248 0.9875809 -0.0048759 0.2177346 -0.0040801 -0.0265666 0.000478 0.0305073 0.0010462 -0.1277396 -0.0274997 0.0029696 -0.2870095 0.005481 -0.1635811 -0.0046391 -0.4907547 -0.0039591 0.2982464 0.331405 -0.001752 0.0299432 -0.0018155 -0.393835 -0.0027125 0.0532015 -0.0027763 -0.0731454 0.2650322 0.4174294 -0.0021977 0.1992287 0.9449038 0.0224176 -0.0129366 0.010962 -0.044911 0.2626466 -0.4145987 -0.0101129 -0.1959963 0.9475521 -0.0038591 -0.0152151 0.0072174 -0.0452296 -0.2570012 -0.2182059 -0.0044077 -0.1078963 -0.2244352 0.0085006 -0.0005142 -0.0015254 -0.1121506 -0.2559774 0.2183576 -0.000361 0.1080885 -0.225526 -0.0106249 0.0020489 -0.0004399 -0.1122654 0.1115984 0.0001398 0.0032608 -0.0000018 0.1999055 0.0030244 0.0008557 0.0030035 -0.1286754 0.0423921 -0.0117036 -0.0254623 0.0522082 -0.0653939 0.1425074 -0.0863289 0.0881018 -0.0551693 0.0423483 0.0118832 -0.0257473 -0.0506648 -0.0600103 -0.1425556 -0.0878822 -0.0878813 -0.0604571 -0.0750853 -0.0873957 -0.0001293 -0.1784672 -0.0454355 -0.0254938 -0.1040442 -0.0122486 0.0561735 -0.0738959 0.0874792 0.0019977 0.1809597 -0.0474264 0.02312 -0.0997742 0.0103061 0.0569615 0.1108902 0.0001727 -0.0029447 -0.0006572 0.1788701 0.0020711 0.0724937 0.001827 0.004095 0.04574 0.0434605 -0.0005417 0.0650548 -0.0043804 -0.0025895 0.001919 -0.0025606 0.1666741 0.0452886 -0.0436257 -0.0013487 -0.0652664 -0.0040003 -0.0005725 0.000532 -0.0005812 0.1667135 -0.0977559 0.000315 0.0007443 0.000292 0.0683347 -0.0008408 0.0021765 -0.0008408 0.1593458 unknown
polarizability: 242.280958|-0.2404288|150.3263255|3.9445054|0.3052524|108.0409496 unknown
InChI: InChI=1S/C11H8Cl2N2S/c12-7-2-1-3-8(13)10(7)9-6-15-5-4-14-11(15)16-9/h1-3,6H,4-5H2
charge 0 multiplicity 1
24 atoms
Cl -1.242026 2.805762 0.045187
Cl -1.252845 -2.79715 -0.006493
S  1.027501 0.018398 -1.634601
N  2.343018 -0.010851 0.665822
N  3.848222 0.006664 -1.115988
C  3.634191 -0.0216 1.386213
C  4.652747 -0.009759 0.164767
C  2.600443 0.004657 -0.726521
C  1.005603 -0.012134 1.044675
C  0.11988 0.001889 -0.002315
C  -1.353557 0.004471 0.026054
C  -2.113346 1.209348 0.037254
C  -2.117978 -1.197482 0.0151
C  -3.521182 1.233892 0.045848
C  -3.525904 -1.216752 0.023297
C  -4.224719 0.009894 0.037476
H  3.735205 -0.928222 2.010147
H  3.738732 0.870178 2.030626
H  5.303408 0.882011 0.193885
H  5.299511 -0.9048 0.173424
H  0.726687 -0.023555 2.097966
H  -4.052775 2.188964 0.0566
H  -4.061175 -2.169799 0.016326
H  -5.319245 0.011974 0.040951
