program: Gaussian 09
title: 000191442
version: EM64L-G09RevD.01
frameworkgroup: C1[X(C13H10N2O6S)]
method: RPBEPBE
basis: SDD
operation: Freq
keyword: #p
keyword: freq=noraman
keyword: PBEPBE/SDD
title: #p freq=noraman PBEPBE/SDD
converged: YES YES NO NO
title: Mulliken charges:
elementType: S O O O O O O N N C C C C C C C C C C C C C H H H H H H H H H H
charge: 0.951368 -0.307028 -0.529995 -0.531615 -0.217869 -0.204112 -0.206930 -0.719377 0.024555 -0.027309 0.238818 -0.233182 -0.223301 -0.312094 -0.306127 0.163132 0.399597 -0.275792 -0.377670 0.382524 -0.346808 -0.327862 0.292234 0.289992 0.283046 0.277311 0.313778 0.265130 0.290927 0.292566 0.340877 0.341218
chargesum: 0.00000
title: Mulliken charges with hydrogens summed into heavy atoms:
elementType: S O O O O O O N N C C C C C C C C C C C C C
charge: 0.951368 -0.307028 -0.529995 -0.531615 -0.217869 -0.204112 -0.206930 -0.037282 0.024555 -0.027309 0.238818 0.059052 0.066691 -0.029048 -0.028817 0.163132 0.399597 0.037986 -0.112540 0.382524 -0.055882 -0.035296
polarizability: 3.81799756e+02 -4.16656020e+00 2.03087584e+02 -2.60353233e+00 1.23528417e+00 9.55646133e+01
1716.lowfreq: -3.2473 -0.0013 0.0006 0.0020 5.5995 7.6487 16.9119 19.5110 35.6658
frequency: 16.8132 19.4687 35.5854 45.2414 59.5552 66.7580 71.4263 113.3299 121.8516 128.4242 139.9904 165.6896 195.0512 248.0410 263.3580 267.4285 282.0963 311.7417 339.8269 342.3828 363.1777 396.5840 408.4177 415.2468 439.2520 459.1190 493.0554 497.4638 512.6185 515.4095 615.9911 616.6620 624.5438 663.6236 668.7287 693.4732 732.7850 747.4365 755.7730 788.2922 793.4664 805.7789 824.8187 841.9684 861.2480 873.6902 877.5113 909.6577 986.4171 990.8107 994.4883 999.7957 1001.5779 1003.8407 1021.4560 1054.2277 1070.5683 1093.4755 1110.3372 1117.1927 1150.2068 1179.7799 1195.2409 1217.8850 1233.8133 1289.3853 1292.5078 1363.5586 1393.7243 1394.3940 1402.2010 1423.2067 1466.7953 1470.7310 1534.5728 1588.8211 1591.0302 1595.6780 1608.0544 1637.9624 3157.6998 3161.8304 3170.6636 3174.8126 3182.0326 3191.5761 3191.7167 3218.7591 3371.7430 3539.4056
redmass: 5.7312 9.4623 4.6971 9.9248 6.4016 7.4412 6.7942 1.5436 9.4162 8.1688 10.3472 7.4821 9.1796 9.4847 4.1397 6.1073 3.7533 7.9362 7.0685 7.6521 6.7769 10.0004 2.8508 3.0093 8.6991 3.6684 7.0860 3.3969 5.3001 4.3536 7.6784 7.1418 8.0998 4.7034 4.7696 6.9706 4.8680 9.9801 3.7455 3.2958 2.8178 8.1111 6.9003 1.2822 1.2556 1.5450 1.5833 3.9057 1.3350 6.9457 1.3799 3.0065 1.3548 1.3815 5.6489 2.3045 1.5057 3.0536 1.2629 1.3489 2.0397 1.1344 2.0457 5.4077 5.2175 1.2748 1.2487 8.1429 3.0229 11.7667 11.0383 3.9912 2.2619 2.4321 1.0852 7.8323 7.6127 6.2901 7.0327 11.6498 1.0890 1.0907 1.0896 1.0972 1.0915 1.0969 1.0953 1.0951 1.0414 1.1006
irintensity: 0.3195 0.8642 1.4479 1.2949 1.8801 0.6698 2.7757 34.3782 1.8045 1.1697 3.2194 5.7671 3.0973 1.8965 5.7424 0.8485 11.4628 0.5584 10.6608 1.2022 27.2819 24.2415 0.0590 0.0072 41.6015 108.9708 17.5266 1.9646 27.6353 77.8121 0.9510 3.0923 0.4734 9.3484 42.5226 24.6251 7.3912 21.0378 12.2461 118.5505 16.7396 137.3809 55.6996 4.6115 1.8576 38.2329 89.5006 58.1695 0.6418 200.1993 0.2855 6.8280 0.3167 1.2924 413.0208 10.1500 24.0540 23.6632 23.1876 3.9715 630.5024 46.6320 158.4350 621.4963 54.6467 7.0648 3.8746 81.3176 38.8043 3.6444 22.0850 53.1807 17.8567 84.1587 22.5189 30.2044 68.1713 26.0784 64.8334 169.0555 3.3697 2.7094 1.2887 0.2715 1.9433 3.6847 0.2829 4.9004 37.8430 29.0590
temp: 298.150 k
press: 1.00000 atm
elementType: 16 8 8 8 8 8 8 7 7 6 6 6 6 6 6 6 6 6 6 6 6 6 1 1 1 1 1 1 1 1 1 1
symmnumber: 1
zpe: 563822.9 jmol-1
zpe.correction: 0.214749 hartree
zpe.thermalcorrener: 0.235398 hartree
zpe.thermalcorrenthalpy: 0.236342 hartree
zpe.thermalcorrgfe: 0.161836 hartree
zpe.sumelectzpe: -1458.462644 hartree
zpe.sumelectthermal: -1458.441995 hartree
zpe.sumelectthermalent: -1458.441050 hartree
zpe.sumelectthermalfe: -1458.515557 hartree
dipole: -3.7115 -0.4876 2.9238
dipole: 4.7499
quadrupole: -194.0504 -131.1707 -136.3645
quadrupole: 0.2769 -23.3963 -2.4753
quadrupole: -40.1885 22.6912 17.4973 0.2769 -23.3963 -2.4753
hfenergy: -1458.6773928 hartree
pointgroup: C01 [X(C13H10N2O6S1)]
dipole: 1.4788346 -1.0772424 -0.3805782 debye
polarizability: 381.4951354|4.8670355|117.1905044|-7.265321|-43.217206|181.7663141 unknown
InChI: InChI=1S/C13H10N2O6S/c14-22(19,20)12-7-1-9(2-8-12)13(16)21-11-5-3-10(4-6-11)15(17)18/h1-8H,14H2
charge 0 multiplicity 1
32 atoms
S  6.054048 0.057391 0.315409
O  -0.762174 -0.005157 0.051361
O  6.809089 1.198189 -0.566667
O  6.20036 -0.091372 1.929903
O  -0.378095 1.05073 -2.022293
O  -7.150011 0.078742 -0.544569
O  -6.888917 -0.870316 1.514437
N  6.515948 -1.566552 -0.406821
N  -6.418727 -0.350412 0.42933
C  4.208235 0.174751 -0.073312
C  1.498075 0.386344 -0.618322
C  3.826053 0.78881 -1.276678
C  3.304203 -0.325966 0.876362
C  2.447242 0.891728 -1.546416
C  1.927186 -0.215763 0.593566
C  0.056507 0.531469 -0.972763
C  -2.181153 -0.03402 0.035073
C  -3.006655 0.431217 -1.020275
C  -2.733503 -0.597539 1.211629
C  -4.946971 -0.240637 0.294739
C  -4.404178 0.322075 -0.879236
C  -4.126303 -0.704098 1.348094
H  4.579761 1.191111 -1.960461
H  3.66745 -0.76265 1.811717
H  2.087997 1.361904 -2.466968
H  1.185331 -0.589379 1.302678
H  -2.570371 0.865192 -1.919275
H  -2.059999 -0.942877 2.000584
H  -5.076968 0.668099 -1.668133
H  -4.585164 -1.133387 2.241945
H  7.209586 -1.406094 -1.155648
H  6.862516 -2.174629 0.353304
