program: Gaussian 09
title: 000191556
version: EM64L-G09RevD.01
frameworkgroup: C1[X(C9H15IN3O14P3)]
method: RPBEPBE
basis: SDD
operation: Freq
keyword: #p
keyword: freq=noraman
keyword: PBEPBE/SDD
title: #p freq=noraman PBEPBE/SDD
converged: YES YES NO NO
title: Mulliken charges:
elementType: I P P P O O O O O O O O O O O O O O N N N C C C C C C C C C H H H H H H H H H H H H H H H
charge: 0.164376 1.470681 1.518027 1.434479 -0.279411 -0.479597 -0.420152 -0.753808 -0.255299 -0.640377 -0.574548 -0.220629 -0.730699 -0.633523 -0.640612 -0.724851 -0.685170 -0.544533 -0.184378 -0.825678 -0.411146 0.015463 -0.190031 -0.150852 -0.027612 -0.421100 0.243462 0.015656 -0.488926 0.237302 0.248011 0.239858 0.278419 0.290554 0.256481 0.264895 0.369844 0.459228 0.372977 0.332776 0.366325 0.411423 0.424459 0.425481 0.442757
chargesum: 0.00000
title: Mulliken charges with hydrogens summed into heavy atoms:
elementType: I P P P O O O O O O O O O O O O O O N N N C C C C C C C C C
charge: 0.164376 1.470681 1.518027 1.434479 -0.279411 -0.109753 -0.047176 -0.753808 -0.255299 -0.228953 -0.574548 -0.220629 -0.730699 -0.209065 -0.640612 -0.299371 -0.242413 -0.544533 -0.184378 -0.366449 -0.044821 0.263474 0.049827 0.127566 0.262942 0.100276 0.243462 0.348432 -0.488926 0.237302
polarizability: 3.03096774e+02 -2.28391986e+01 3.00049910e+02 1.38923615e+01 1.49089371e+01 1.78502323e+02
1716.lowfreq: -8.3698 -7.2332 -3.4637 -0.0016 -0.0015 -0.0014 4.7260 14.6771 19.8629
frequency: -4.3501 14.5833 19.8012 28.3095 30.5394 39.9323 54.5182 55.9698 65.0609 66.4101 77.0322 86.4036 106.6344 124.3387 126.5586 153.2766 160.6626 164.4857 170.4190 178.4898 186.7851 192.4271 207.6512 208.7136 214.4655 226.2012 230.7609 241.3564 244.3280 262.0377 268.8935 269.1916 285.4685 303.7209 310.0153 319.4874 326.8200 330.7654 336.0659 341.0863 362.0011 377.4317 390.8893 397.6967 413.3873 416.9565 446.7097 467.5589 497.7870 512.4529 520.5040 547.3482 552.6039 559.8994 586.0236 617.7606 638.5234 671.0766 686.9755 690.8404 692.8578 712.4451 727.4428 730.9404 742.0497 771.6723 778.4853 784.1371 795.1631 814.0426 820.6904 832.5598 857.4395 894.1227 942.9500 945.3957 948.2654 976.6350 980.2834 992.4863 1024.1449 1034.8428 1038.6848 1047.4651 1052.0239 1070.3676 1073.0271 1087.4341 1111.0403 1116.9190 1135.1279 1163.7885 1200.2969 1222.6035 1242.6409 1249.4097 1262.3989 1264.9635 1280.0652 1305.5370 1315.3490 1323.7507 1337.2382 1360.1803 1364.8854 1370.7024 1379.0110 1381.9627 1425.7287 1446.8300 1462.8999 1591.6743 1636.5880 1660.8257 2739.0273 3004.5827 3007.9412 3019.5419 3035.1830 3061.8221 3071.2291 3134.3398 3303.4219 3488.7683 3522.8910 3574.8597 3592.7438 3601.9713 3614.6894
redmass: 13.0502 10.8964 14.2931 9.6312 9.0768 9.5294 9.0829 11.4841 9.6849 8.1793 7.0207 8.5669 8.0498 3.8988 5.4089 3.0551 3.7925 9.4102 9.0478 5.1254 8.7220 4.4934 1.4568 5.6629 2.7355 6.4257 2.9097 5.2957 5.9869 4.7788 6.3019 5.0925 3.7939 5.9685 6.4110 6.8080 2.4411 2.9938 6.5891 3.1077 8.1857 6.8172 6.9362 5.0114 8.4980 9.0032 3.8809 4.5372 1.2751 4.5849 9.1343 4.6303 13.0737 6.2497 6.8630 5.4367 6.3056 13.8111 3.2400 3.1016 2.6305 8.8278 4.6039 4.0878 8.3679 4.5514 2.3166 3.2460 4.7152 2.2783 2.3684 2.9668 3.1659 3.7546 1.8817 2.0515 3.8345 4.6391 2.5439 3.3704 1.4374 2.9735 1.6310 3.3691 3.7211 2.2086 3.0235 4.6261 3.3896 3.5755 4.0259 1.3947 4.9606 1.4077 1.3247 1.3518 1.5854 1.2994 1.6126 2.6253 1.2423 1.3326 1.3378 1.4129 1.4940 1.9089 1.2759 1.3468 1.6129 1.1159 1.1703 5.8342 10.6699 6.3986 1.0744 1.0635 1.0843 1.0857 1.0854 1.0871 1.1042 1.0965 1.0814 1.0644 1.0769 1.0664 1.0665 1.0664 1.0673
irintensity: 1.6936 2.6682 0.8003 0.8030 0.3408 1.8328 0.9027 0.3039 0.6818 1.3687 1.5125 0.1092 4.1889 35.2978 10.0710 11.7673 11.7038 6.0283 1.8125 5.8419 2.8469 17.2774 85.0776 7.3802 93.7335 8.2175 52.4686 8.0710 10.0391 8.7502 18.4829 7.8497 15.6152 8.2820 1.3248 10.8071 38.5494 48.5363 3.5418 125.5011 206.2564 118.5934 11.3421 4.9662 27.4791 7.7914 13.8681 19.8847 133.3618 24.1451 188.1750 11.3491 23.9702 49.2364 45.1355 1.2846 2.3221 118.4839 37.2162 30.3441 18.0611 1.8202 29.3659 222.1017 9.2000 328.5974 120.9479 311.8129 200.2658 610.6021 280.5820 170.5283 105.6182 21.8339 10.8267 130.4702 172.8610 16.4912 64.7455 32.0198 35.7850 56.9075 39.7173 83.1005 79.6432 118.0909 93.2622 62.3526 212.7950 24.2227 51.8729 28.6871 6.1746 47.8030 23.9792 16.6656 103.0284 34.9545 92.3839 74.4510 102.3392 76.3545 11.7145 7.7890 11.9297 34.9876 45.5194 25.2689 31.5268 20.0121 26.5669 45.7518 413.5435 637.0561 611.5501 8.7646 27.4026 28.4816 7.7680 15.0316 11.9412 101.1423 479.1623 46.1789 71.1236 134.7496 99.0019 100.9566 29.3590
temp: 298.150 k
press: 1.00000 atm
elementType: 53 15 15 15 8 8 8 8 8 8 8 8 8 8 8 8 8 8 7 7 7 6 6 6 6 6 6 6 6 6 1 1 1 1 1 1 1 1 1 1 1 1 1 1 1
symmnumber: 1
zpe: 753274.0 jmol-1
zpe.correction: 0.286907 hartree
zpe.thermalcorrener: 0.319953 hartree
zpe.thermalcorrenthalpy: 0.320897 hartree
zpe.thermalcorrgfe: 0.219648 hartree
zpe.sumelectzpe: -2602.216808 hartree
zpe.sumelectthermal: -2602.183762 hartree
zpe.sumelectthermalent: -2602.182818 hartree
zpe.sumelectthermalfe: -2602.284066 hartree
dipole: -5.1686 1.5887 1.3678
dipole: 5.5775
quadrupole: -284.1894 -187.9859 -211.9443
quadrupole: -1.9312 -8.0891 -11.6101
quadrupole: -56.1495 40.0539 16.0956 -1.9312 -8.0891 -11.6101
hfenergy: -2602.5037149 hartree
pointgroup: C01 [X(C9H15I1N3O14P3)]
dipole: 1.6537536 -0.5056762 1.3507867 debye
polarizability: 288.7045732|-22.4398727|237.3153647|2.4676262|-69.2823226|255.6290686 unknown
InChI: InChI=1S/C9H15IN3O14P3/c10-3-2-13(9(17)12-7(3)16)8-6(15)5(14)4(25-8)1-11-28(18,19)26-30(23,24)27-29(20,21)22/h2,4-6,8,11-12,14-15,18,20-21,23H,1H2
charge 0 multiplicity 1
45 atoms
I  -2.561509 2.681726 -3.805399
P  1.363869 0.972849 -0.76193
P  4.390799 0.29327 -1.265183
P  4.918316 -0.734606 1.648616
O  -1.191956 -0.427442 0.73564
O  -1.99394 -3.505522 1.616232
O  -3.615639 -2.969191 -0.424972
O  3.02878 1.295806 -1.421404
O  -5.033361 0.160829 1.370927
O  1.231153 2.362052 0.221507
O  0.371109 0.746579 -1.972851
O  -5.434337 3.174911 -2.168688
O  4.914039 0.501079 0.371452
O  5.510468 1.127706 -2.209201
O  4.284311 -1.266738 -1.593343
O  3.457049 -0.294967 2.470785
O  4.421474 -2.135901 0.863133
O  6.204857 -0.702553 2.552946
N  -3.288845 0.226506 -0.227938
N  1.608646 -0.289238 0.336733
N  -5.168681 1.643467 -0.431342
C  -0.398678 -1.672318 0.965114
C  -1.285725 -2.860896 0.499212
C  -2.417717 -2.178649 -0.321981
C  -2.588117 -0.848843 0.467253
C  0.911854 -1.574964 0.157526
C  -4.53945 0.644344 0.318603
C  -2.748482 0.814647 -1.374413
C  -3.406902 1.801365 -2.068756
C  -4.722495 2.289098 -1.627039
H  -0.190538 -1.746401 2.050045
H  -0.723033 -3.606259 -0.094143
H  -2.084878 -1.969227 -1.352921
H  -3.140279 -1.029719 1.408189
H  0.700811 -1.710271 -0.918917
H  1.602434 -2.379182 0.47325
H  -1.43266 -4.196867 2.042452
H  2.074524 -0.11015 1.245496
H  -3.745215 -3.417683 0.455095
H  -1.742519 0.485684 -1.655971
H  -6.077752 1.953468 -0.072157
H  1.106762 3.218301 -0.262526
H  5.27237 2.068386 -2.419499
H  3.591469 0.152774 3.344328
H  4.391209 -2.065557 -0.173758
