program: Gaussian 09
title: 000191423
version: EM64L-G09RevD.01
frameworkgroup: C1[X(C4H7O6P)]
method: RPBEPBE
basis: SDD
operation: Freq
keyword: #pfreq=noraman
keyword: PBEPBE/SDD
title: #p freq=noraman PBEPBE/SDD
converged: YES YES NO NO
title: Mulliken charges:
elementType: P O O O O O O C C C C H H H H H H H
charge: 1.396797 -0.481943 -0.666570 -0.697153 -0.378708 -0.598464 -0.277027 -0.218456 -0.014106 0.226684 -0.555113 0.271602 0.307931 0.230006 0.220008 0.413461 0.427451 0.393601
chargesum: 0.00000
title: Mulliken charges with hydrogens summed into heavy atoms:
elementType: P O O O O O O C C C C
charge: 1.396797 -0.481943 -0.253109 -0.269702 0.014893 -0.598464 -0.277027 0.053145 0.293825 0.226684 -0.105098
polarizability: 1.05520515e+02 -1.40560740e+01 8.73116299e+01 -4.99082613e-01 9.41342063e-02 6.36401680e+01
1716.lowfreq: -13.3540 -5.9126 -0.0025 -0.0024 -0.0013 12.5411 24.5747 66.7176 76.9031
frequency: 24.4652 66.6874 76.8849 131.1840 139.8061 161.2422 204.4228 234.2776 244.4814 267.6591 312.4324 317.4621 345.1098 371.3769 395.5930 484.8540 570.5273 572.1642 618.6218 641.1584 677.7081 698.3441 732.9774 765.7758 856.0341 947.7017 970.1449 985.8531 990.9669 1015.3613 1068.5065 1102.0482 1128.3175 1135.5920 1248.0886 1274.3108 1293.6055 1341.5322 1426.8078 1634.9706 1654.5656 3061.3579 3094.4023 3141.0804 3205.4639 3456.7661 3515.1334 3582.5243
redmass: 7.1592 3.3300 11.6171 4.9607 4.4391 6.4993 2.4682 3.0829 4.0919 2.5950 2.7695 7.4890 6.8948 4.4522 6.4369 3.7321 1.5658 2.7381 1.5817 2.2574 3.6889 3.6301 4.8995 13.0969 2.8422 2.7437 1.3178 2.2073 2.7810 1.1847 2.2092 2.0398 1.5808 2.5515 1.2870 1.2052 1.1946 2.1861 1.1808 8.1210 4.7327 1.0849 1.0622 1.0949 1.1140 1.0647 1.0643 1.0659
irintensity: 2.0189 0.4295 2.2114 20.9215 23.4768 20.7415 30.1751 11.1379 26.2163 22.2817 14.0122 23.4200 20.6350 25.7009 38.2658 10.2671 83.9467 1.9115 225.0271 70.4878 44.0566 143.2769 170.6335 185.8432 11.4751 51.0440 107.3624 70.8396 250.2577 15.8349 240.5947 62.3739 226.6812 40.9981 2.8528 2.3592 1.9282 40.0465 13.1857 232.1209 22.6949 5.0620 5.8671 4.8626 12.0977 174.2367 41.0727 92.9879
temp: 298.150 k
press: 1.00000 atm
elementType: 15 8 8 8 8 8 8 6 6 6 6 1 1 1 1 1 1 1
symmnumber: 1
zpe: 312143.7 jmol-1
zpe.correction: 0.118889 hartree
zpe.thermalcorrener: 0.131714 hartree
zpe.thermalcorrenthalpy: 0.132658 hartree
zpe.thermalcorrgfe: 0.079024 hartree
zpe.sumelectzpe: -948.299834 hartree
zpe.sumelectthermal: -948.287009 hartree
zpe.sumelectthermalent: -948.286065 hartree
zpe.sumelectthermalfe: -948.339699 hartree
dipole: 4.0533 2.5084 -1.9951
dipole: 5.1674
quadrupole: -63.0663 -67.9298 -74.7026
quadrupole: -0.5556 5.2593 1.0759
quadrupole: 5.5000 0.6365 -6.1364 -0.5556 5.2593 1.0759
hfenergy: -948.4187236 hartree
pointgroup: C01 [X(C4H7O6P1)]
dipole: -1.8097909 -0.5828148 -0.7197592 debye
dipolederiv: 2.5845266 -0.3485992 -0.0497262 -0.0471453 1.861634 -0.0237337 0.2384686 -0.0362498 1.6718208 -1.3539526 0.372438 -0.1050279 0.2554288 -0.7194056 -0.0081635 -0.2715479 0.0236781 -0.5491007 -1.0936402 0.0790894 0.1581031 0.0846901 -0.3530813 -0.0099958 0.2624127 0.0071411 -0.7717797 -0.7497426 0.0088953 -0.0328717 -0.0316825 -1.0904307 0.0794449 -0.0470007 -0.0184155 -0.6713607 -1.3499571 -0.0542628 -0.0139077 -0.0525244 -0.2819603 -0.0790141 0.0540146 -0.0526205 -0.3388397 -0.7645925 0.0861837 -0.0305702 0.0384143 -0.6470757 -0.0385996 -0.1134095 -0.0241138 -0.648693 -0.9185908 0.0421794 -0.0185816 0.3464854 -0.8349959 0.1921559 -0.1785702 0.320307 -0.3842384 0.851739 -0.1996042 -0.0046679 -0.254506 0.2434381 0.0756379 -0.2310266 0.229654 0.1544448 -0.2337063 -0.0714366 0.1230859 0.0146596 -0.0490676 0.0144129 0.1490125 0.1384871 -0.0453422 1.5854711 0.0880599 0.0115203 -0.1999885 0.9492369 -0.3100938 0.1342023 -0.491028 0.3636204 -0.2284548 -0.0626525 0.1546725 -0.0652713 -0.0681833 0.112151 0.1650759 0.0334672 0.0658168 -0.0384483 0.0066657 -0.073702 0.0321903 0.0821941 0.0329147 -0.0263308 -0.0187414 0.0209565 0.1861849 -0.0364251 -0.0800499 0.0190209 0.0724513 0.0140543 -0.0523791 -0.041759 0.052763 0.1663509 0.0533733 -0.036244 0.0527747 -0.029914 -0.082164 -0.0340801 -0.0970991 0.0525552 0.1140771 0.020396 -0.0927644 0.0054695 0.0994648 -0.0611329 -0.1132241 -0.0031428 -0.0493303 0.4066208 -0.0059988 0.0306389 -0.0389745 0.1645916 -0.0301083 -0.0084377 -0.044896 0.3756996 0.4685386 -0.011832 0.0630255 -0.1386603 0.4168556 0.0026022 0.0636429 -0.0415208 0.3704436 0.3675761 0.0335304 -0.0029327 -0.0203808 0.1842479 0.1196318 0.0091772 0.1168519 0.3305638 unknown
polarizability: 96.5067624|-16.6029054|95.8821787|2.2252229|-3.7941396|64.0833715 unknown
InChI: InChI=1S/C4H7O6P/c1-2-3(4(5)6)10-11(7,8)9/h2-3,5,7-8H,1H2
charge 0 multiplicity 1
18 atoms
P  1.999627 -0.189775 0.168658
O  0.802454 0.185746 -1.058715
O  3.431198 0.120318 -0.691268
O  2.095237 -1.903316 0.177886
O  -2.620821 -0.546602 0.016038
O  1.809575 0.585191 1.533987
O  -0.650604 -1.661914 0.492024
C  -0.582814 0.533894 -0.686927
C  -0.701014 1.806495 0.136024
C  -1.246841 -0.671707 0.003229
C  -1.371398 2.894865 -0.30967
H  -1.084562 0.677537 -1.659201
H  -0.186382 1.800393 1.104525
H  -1.435194 3.804606 0.296744
H  -1.874428 2.913542 -1.284663
H  3.838688 -0.691707 -1.089425
H  1.207985 -2.304894 0.404176
H  -3.039908 -1.320372 0.482183
