program: Gaussian 09
title: 000191414
version: EM64L-G09RevD.01
frameworkgroup: C1[X(C16H16O3)]
method: RPBEPBE
basis: SDD
operation: Freq
keyword: #pfreq=noraman
keyword: PBEPBE/SDD
title: #p freq=noraman PBEPBE/SDD
converged: NO YES NO NO
title: Mulliken charges:
elementType: O O O C C C C C C C C C C C C C C C C H H H H H H H H H H H H H H H H
charge: -0.252780 -0.291819 -0.266629 -0.465127 0.477821 0.351415 0.219936 -0.335568 -0.358524 -0.359369 -0.315394 -0.386554 -0.387482 -0.226441 -0.226412 0.183189 -0.229619 -0.220244 -0.675693 0.216692 0.216767 0.253686 0.254969 0.267628 0.270921 0.234911 0.234837 0.229575 0.229585 0.231652 0.227598 0.227654 0.210867 0.228983 0.228968
chargesum: 0.00000
title: Mulliken charges with hydrogens summed into heavy atoms:
elementType: O O O C C C C C C C C C C C C C C C C
charge: -0.252780 -0.291819 -0.266629 -0.031667 0.477821 0.351415 0.219936 -0.081882 -0.103555 -0.091740 -0.044472 -0.151643 -0.152645 0.003134 0.003173 0.183189 0.002032 0.235008 -0.006875
polarizability: 3.10655803e+02 -1.54586060e+01 1.45716724e+02 -1.17485387e-01 -9.79281700e-02 1.27109475e+02
1716.lowfreq: -5.3093 -4.7101 -0.0008 0.0004 0.0007 2.8763 11.0642 23.1679 34.0926
frequency: 5.0506 22.9822 34.0240 43.3932 65.3897 88.4295 91.7626 106.3326 136.5433 153.7810 215.5542 244.0577 250.8033 303.3716 324.3581 342.3120 359.2667 402.2839 403.9546 417.3895 488.4572 506.3350 509.8243 560.7944 617.6180 627.0758 638.5639 676.8201 702.0525 747.7294 753.0474 778.9962 799.1459 804.5467 825.6946 843.4782 851.5819 851.6869 853.1446 917.4426 938.9151 971.0315 976.9106 979.2891 986.8858 991.0458 998.6103 998.7640 1023.4305 1026.8898 1062.3036 1090.5343 1111.6223 1117.1462 1135.9718 1169.1048 1173.8900 1187.7822 1194.4374 1220.5281 1228.4767 1247.5302 1250.2135 1300.1621 1326.4376 1354.4484 1359.3949 1378.8240 1387.8093 1398.2182 1428.4319 1441.8138 1462.0956 1474.5828 1477.2285 1486.5449 1487.4230 1495.6982 1570.7011 1597.8512 1613.0721 1618.2218 1621.5190 2967.1305 2994.0898 3007.4311 3029.5912 3064.5866 3091.2732 3104.7872 3122.9332 3124.7983 3136.7863 3149.2938 3150.0800 3158.3900 3165.7634 3170.8530 3181.6280
redmass: 3.7625 5.5773 3.0852 4.9401 2.7994 6.0232 4.4142 3.2069 5.9022 3.5753 4.9750 1.2770 4.9211 4.9195 4.6168 2.4644 5.5164 2.7915 4.6782 2.9929 4.7465 2.9559 3.7693 6.1279 6.3401 7.1087 6.1147 4.1934 1.8150 2.3087 4.5441 4.0763 1.1006 5.1078 1.2962 3.4734 3.9736 1.6321 1.2727 2.7148 2.4685 1.4972 1.3937 1.4196 1.3562 5.9081 1.9136 1.8527 2.2951 2.1754 5.2298 1.5051 2.1955 1.3114 1.4682 1.2962 1.0542 1.1145 1.0869 2.7887 2.6506 1.1336 3.1631 1.2999 1.2703 1.4301 1.4519 4.2726 8.4895 1.2726 4.3270 2.1891 1.0408 1.0596 1.1618 1.5606 1.4465 2.3317 7.7906 6.1277 9.1542 6.2093 7.3272 1.0558 1.0356 1.0581 1.1078 1.1064 1.0986 1.1025 1.0854 1.0884 1.0920 1.0882 1.0963 1.0886 1.1017 1.0955 1.0969
irintensity: 0.0959 0.0553 0.7842 0.2922 1.9111 0.1230 0.5029 0.0010 2.4671 8.0888 2.2168 1.2454 3.3048 0.0017 8.8517 1.0995 6.8371 0.0019 0.6455 0.0546 1.8054 8.3846 14.6718 1.5274 0.1308 8.2786 31.1512 25.0443 51.2890 42.4889 16.8003 30.6465 1.8980 3.0953 6.4409 32.1397 2.1982 49.7486 4.4520 151.4901 51.4722 4.3680 0.0149 0.0391 0.0198 1.3613 14.7491 14.6565 27.4902 6.2410 415.2624 7.1259 3.6492 14.0430 5.4402 327.7651 0.0011 1.3168 1.2284 169.8312 85.1396 0.0162 459.6285 2.5933 0.2723 21.5402 5.1425 64.5898 0.5774 20.1767 2.3234 9.4225 11.9105 5.5371 29.6496 10.0591 11.7342 65.2112 1.0099 0.6792 417.3149 5.0618 109.9075 35.5277 23.7458 25.2673 23.4073 9.1328 35.0025 46.6131 5.2327 2.2263 15.3132 3.5381 37.9503 2.2395 22.9512 15.4681 2.9846
temp: 298.150 k
press: 1.00000 atm
elementType: 8 8 8 6 6 6 6 6 6 6 6 6 6 6 6 6 6 6 6 1 1 1 1 1 1 1 1 1 1 1 1 1 1 1 1
symmnumber: 1
zpe: 731793.3 jmol-1
zpe.correction: 0.278725 hartree
zpe.thermalcorrener: 0.296484 hartree
zpe.thermalcorrenthalpy: 0.297428 hartree
zpe.thermalcorrgfe: 0.228392 hartree
zpe.sumelectzpe: -843.606665 hartree
zpe.sumelectthermal: -843.588907 hartree
zpe.sumelectthermalent: -843.587963 hartree
zpe.sumelectthermalfe: -843.656999 hartree
dipole: 2.3715 -0.8584 -0.0040
dipole: 2.5220
quadrupole: -89.8910 -112.8246 -106.9584
quadrupole: 11.6304 0.0181 -0.0481
quadrupole: 13.3336 -9.5999 -3.7337 11.6304 0.0181 -0.0481
hfenergy: -843.8853907 hartree
pointgroup: C01 [X(C16H16O3)]
dipole: 0.9360307 -0.3291871 -0.0056293 debye
polarizability: 310.9223636|-13.9564356|145.449755|-0.4137059|0.0936076|127.1098831 unknown
InChI: InChI=1S/C16H16O3/c1-2-18-16(17)14-8-10-15(11-9-14)19-12-13-6-4-3-5-7-13/h3-11H,2,12H2,1H3
charge 0 multiplicity 1
35 atoms
O  1.488277 -0.252358 -0.005952
O  -4.887237 -0.587337 -0.001756
O  -4.717345 1.739264 0.025293
C  2.436956 0.897494 0.005165
C  3.838533 0.337586 -0.001009
C  0.120459 0.035691 -0.00101
C  -2.69191 0.376379 0.007079
C  -0.432588 1.344915 0.01392
C  -0.734302 -1.099506 -0.012064
C  -1.831624 1.502258 0.017907
C  -2.125942 -0.929459 -0.008067
C  4.500846 0.048173 1.218026
C  4.504006 0.081615 -1.225741
C  5.805926 -0.49195 1.214438
C  5.809161 -0.458421 -1.233547
C  -4.158553 0.611711 0.011821
C  6.462837 -0.745497 -0.012413
C  -6.371498 -0.437758 0.000814
C  -6.956607 -1.84666 -0.018406
H  2.247685 1.503217 0.913732
H  2.24677 1.52148 -0.890739
H  0.206611 2.232008 0.022326
H  -0.2788 -2.09425 -0.023598
H  -2.280125 2.50129 0.02945
H  -2.790592 -1.797471 -0.016553
H  3.98992 0.239844 2.169406
H  3.99559 0.299313 -2.172862
H  6.309335 -0.712928 2.16207
H  6.31504 -0.653304 -2.18558
H  7.476464 -1.161901 -0.016791
H  -6.664288 0.130506 0.902576
H  -6.664896 0.155089 -0.884782
H  -8.060617 -1.792856 -0.017315
H  -6.636225 -2.394278 -0.921464
H  -6.635667 -2.419102 0.868931
