program: Gaussian 09
title: 000191486
version: EM64L-G09RevD.01
frameworkgroup: C1[X(C14H23NO11)]
method: RPBEPBE
basis: SDD
operation: Freq
keyword: #p
keyword: freq=noraman
keyword: PBEPBE/SDD
title: #p freq=noraman PBEPBE/SDD
converged: YES YES NO NO
title: Mulliken charges:
elementType: O O O O O O O O O O O N C C C C C C C C C C C C C C H H H H H H H H H H H H H H H H H H H H H H H
charge: -0.259828 -0.435799 -0.447524 -0.399790 -0.471534 -0.246008 -0.438827 -0.202563 -0.317527 -0.257601 -0.455413 -0.378758 -0.124373 -0.068904 -0.235853 -0.494557 -0.131200 0.150990 -0.137757 0.164844 -0.380420 0.296391 -0.772517 0.257545 -0.135748 -0.663482 0.336421 0.245394 0.254241 0.275129 0.232222 0.224847 0.277219 0.324833 0.351457 0.239023 0.250755 0.382982 0.379942 0.388297 0.217379 0.259913 0.262772 0.400118 0.233210 0.228556 0.230879 0.233734 0.356892
chargesum: 0.00000
title: Mulliken charges with hydrogens summed into heavy atoms:
elementType: O O O O O O O O O O O N C C C C C C C C C C C C C C
charge: -0.259828 -0.084342 -0.064542 -0.019848 -0.083237 -0.246008 -0.038708 -0.202563 -0.317527 -0.257601 -0.098521 -0.053925 0.212049 0.176490 0.018387 0.012793 0.093646 0.150990 0.139462 0.164844 0.109358 0.296391 -0.032453 0.257545 0.097462 0.029687
polarizability: 2.22305259e+02 -7.57053627e+00 2.04639014e+02 -8.72191040e+00 -5.50625181e+00 1.57584715e+02
1716.lowfreq: -9.0071 -4.0284 -0.0004 0.0002 0.0009 7.2195 17.6448 21.7564 32.4493
frequency: 17.5575 20.5171 32.4141 40.3723 48.5671 55.1880 63.0974 71.6748 76.2162 88.5558 95.7329 111.1745 119.1856 147.3470 154.2738 168.8248 201.1419 214.7267 221.3743 227.4119 242.1898 246.2866 266.6748 274.3648 289.1450 300.5483 303.9771 316.6277 321.6232 333.0078 360.8367 363.6152 374.9930 385.3091 412.9069 421.0319 430.4210 442.0844 468.1251 473.8753 519.4132 540.4396 552.9958 560.0535 570.5538 579.9526 590.3517 603.5847 614.4917 626.4079 653.8247 687.6894 701.7878 720.6280 754.3747 786.9004 794.9696 834.6547 862.1410 880.6108 907.7500 913.8579 939.0092 945.2860 969.4773 974.4320 996.0073 997.3219 1013.4219 1018.0807 1043.3758 1045.1280 1047.6290 1062.6417 1071.0300 1073.7306 1081.9533 1095.1804 1099.8201 1109.0449 1124.0836 1129.9637 1164.3994 1198.6351 1213.1206 1221.5669 1237.2930 1245.4094 1257.7280 1280.5447 1287.1639 1290.6095 1304.1978 1304.9497 1308.4421 1328.2405 1332.7434 1339.7023 1343.5838 1354.2542 1354.8436 1365.6738 1379.5691 1383.7260 1390.4196 1392.0835 1409.9441 1428.4579 1448.4537 1451.3053 1453.5477 1463.1172 1467.4515 1472.8307 1499.1118 1606.2147 1624.6231 1661.1246 2945.7018 2948.3292 2965.5376 2999.2303 3001.8178 3024.0407 3034.8760 3038.8284 3039.5493 3043.0965 3095.0507 3101.0420 3106.7518 3108.5512 3108.9226 3123.3330 3193.6983 3482.3318 3515.8126 3528.3799 3539.1546 3539.2039 3565.2258
redmass: 6.3952 4.5479 4.7735 7.1853 6.7646 2.8927 3.8862 1.7464 4.8221 5.7528 4.9724 6.3507 4.8338 6.1319 5.2706 5.3533 4.1671 4.0077 2.6196 3.7233 3.4664 2.0064 3.1331 4.8280 3.6462 4.1332 1.4540 2.8369 2.3324 4.7715 1.9530 3.4344 3.1176 2.9697 1.7813 2.9347 3.2186 4.7667 4.7764 4.1943 3.6131 2.5108 2.0625 1.8478 3.2232 1.5210 2.0048 3.0310 2.1975 4.3998 3.4518 4.5320 4.2863 6.2612 4.4789 1.0837 3.2433 3.5846 3.6248 3.0949 4.4263 3.2028 3.9803 2.6967 4.8293 5.1138 1.7579 4.0937 3.6963 2.0615 2.6097 1.8479 2.5329 2.3039 3.6396 2.5460 2.3128 2.1048 2.3176 2.9779 3.1368 3.2209 2.5073 1.2885 1.2497 1.2637 1.2082 1.5386 1.3659 1.7289 1.3036 1.7599 1.2324 1.2658 1.2791 1.4560 1.3011 1.2278 1.3072 1.3788 1.3470 1.6675 1.2722 1.2810 1.5015 1.2304 1.5528 1.3905 1.0499 1.1015 1.0973 1.0566 1.1046 1.0650 1.9955 4.6700 9.3234 9.9625 1.0827 1.0830 1.0840 1.0342 1.0361 1.0606 1.0851 1.0835 1.0837 1.0606 1.1029 1.0985 1.1005 1.1006 1.1015 1.1087 1.0676 1.0650 1.0656 1.0646 1.0699 1.0724 1.0663
irintensity: 0.1788 1.0141 0.3169 1.6144 0.4583 5.3261 1.2103 0.8124 2.9910 4.9205 1.2443 2.2887 0.5092 5.1907 3.6417 10.8304 0.4760 2.0918 0.6977 2.9066 12.7022 5.2063 0.4228 5.9760 12.6135 8.4706 82.6032 62.5250 46.0809 17.5035 72.4278 35.4243 16.5150 9.0566 119.8587 47.6387 3.9216 31.7510 4.9303 29.0395 12.4640 11.9018 45.3328 93.6199 50.0296 116.5022 22.5230 101.1690 101.2462 4.3645 11.3863 3.1707 17.1367 19.7074 3.0920 187.7858 7.6702 3.7958 84.4885 9.4136 97.1271 5.4323 46.5882 9.7928 48.0376 133.5428 19.5668 56.7192 225.6680 44.9334 83.8495 21.9183 39.9828 86.3638 63.6366 42.8256 15.2365 136.5859 17.0510 24.6467 14.4679 9.6190 151.7461 4.4979 15.7647 42.7653 27.8121 137.6531 16.2161 56.8708 6.7487 26.4407 17.8214 0.6986 24.0699 17.9585 4.3075 49.1088 4.2650 44.6626 9.7657 13.1990 22.9153 25.7548 9.4617 59.8414 14.7599 117.1211 18.0787 11.4643 14.0709 19.1364 35.3142 15.6585 225.2512 173.3854 141.9130 184.1262 20.8137 9.3369 40.3676 12.0391 8.1136 10.6694 17.3450 4.7232 7.0535 28.3505 6.7349 7.5521 26.3678 15.5555 23.7295 11.1554 442.6261 19.9851 91.8874 55.2046 35.9442 20.5133 7.6894
temp: 298.150 k
press: 1.00000 atm
elementType: 8 8 8 8 8 8 8 8 8 8 8 7 6 6 6 6 6 6 6 6 6 6 6 6 6 6 1 1 1 1 1 1 1 1 1 1 1 1 1 1 1 1 1 1 1 1 1 1 1
symmnumber: 1
zpe: 1002534.0 jmol-1
zpe.correction: 0.381845 hartree
zpe.thermalcorrener: 0.410273 hartree
zpe.thermalcorrenthalpy: 0.411217 hartree
zpe.thermalcorrgfe: 0.321242 hartree
zpe.sumelectzpe: -1427.443039 hartree
zpe.sumelectthermal: -1427.414611 hartree
zpe.sumelectthermalent: -1427.413667 hartree
zpe.sumelectthermalfe: -1427.503643 hartree
dipole: 8.6576 2.3124 -4.3629
dipole: 9.9667
quadrupole: -171.0738 -136.4143 -154.6052
quadrupole: -3.9120 5.6367 -5.1114
quadrupole: -17.0427 17.6168 -0.5741 -3.9120 5.6367 -5.1114
hfenergy: -1427.8248842 hartree
pointgroup: C01 [X(C14H23N1O11)]
dipole: -3.3469717 0.5676815 1.9625099 debye
polarizability: 221.4837322|9.6207011|201.7307585|-9.6154206|12.5372603|161.3144984 unknown
InChI: InChI=1S/C14H23NO11/c1-5(16)12(21)25-4-8(19)10(20)11-9(15-6(2)17)7(18)3-14(24,26-11)13(22)23/h5,7-11,15-16,18-20,22,24H,3-4H2,1-2H3
charge 0 multiplicity 1
49 atoms
O  -1.487626 -0.950001 -0.786801
O  -3.474247 2.740301 -0.254819
O  1.154758 0.425281 -0.831076
O  -3.235352 -1.737902 -2.124519
O  0.033618 -2.59107 0.967233
O  3.31151 -0.874271 0.911132
O  -2.953672 -3.072314 0.333369
O  -4.335615 -1.37827 1.141653
O  0.956385 2.887426 0.206611
O  3.960421 -1.925073 -1.068791
O  6.099625 -0.23767 -1.358611
N  -1.098822 2.31305 1.142274
C  -1.515229 1.374558 0.080535
C  -0.998506 -0.07416 0.318696
C  -3.056079 1.356223 0.017286
C  -3.552831 0.392209 -1.076353
C  0.541897 -0.199205 0.329123
C  -2.952761 -1.008038 -0.924834
C  0.997993 -1.686845 0.318266
C  -3.514402 -1.788513 0.299167
C  2.281407 -1.925868 1.133449
C  0.052118 3.070143 1.089943
C  0.198488 4.153012 2.147371
C  4.068378 -0.9871 -0.241542
C  5.076019 0.157903 -0.391093
C  4.379923 1.470662 -0.814335
H  -1.113964 1.729781 -0.887257
H  -1.384082 -0.458731 1.288205
H  -3.463006 1.031291 1.001062
H  -3.240046 0.765237 -2.067042
H  -4.655457 0.322411 -1.054882
H  0.884607 0.28902 1.268383
H  1.148788 -1.959334 -0.742759
H  -1.824749 2.60666 1.799542
H  -4.459955 2.770799 -0.349454
H  2.054624 -1.858902 2.209226
H  2.707415 -2.912795 0.887923
H  1.202531 1.416506 -0.637824
H  -2.775927 -2.618182 -2.082955
H  -0.738774 -2.705669 0.352444
H  -0.614485 4.152645 2.892847
H  1.163245 4.02592 2.666354
H  0.22326 5.137021 1.647873
H  -3.304938 -3.59469 1.103587
H  5.590953 0.303681 0.575328
H  3.693559 1.831845 -0.029193
H  3.801847 1.324291 -1.742488
H  5.158337 2.231007 -0.99499
H  5.696023 -0.929481 -1.951166
