program: Gaussian 09
title: 000191397
version: EM64L-G09RevD.01
frameworkgroup: C1[X(C7H8NO6P)]
method: RPBEPBE
basis: SDD
operation: Freq
keyword: #p
keyword: freq=noraman
keyword: PBEPBE/SDD
title: #p freq=noraman PBEPBE/SDD
converged: YES YES NO NO
title: Mulliken charges:
elementType: P O O O O O O N C C C C C C C H H H H H H H H
charge: 1.409433 -0.593392 -0.743047 -0.643617 -0.349560 -0.549263 -0.372294 -0.377578 0.153768 0.268826 -0.327858 -0.325749 -0.203312 -0.232832 0.188665 0.265729 0.282645 0.240977 0.240576 0.447239 0.426166 0.419204 0.375277
chargesum: 0.00000
title: Mulliken charges with hydrogens summed into heavy atoms:
elementType: P O O O O O O N C C C C C C C
charge: 1.409433 -0.593392 -0.316881 -0.224413 -0.349560 -0.549263 0.002983 0.069660 0.153768 0.268826 -0.045213 -0.060020 0.037664 0.007745 0.188665
polarizability: 1.54810422e+02 7.09391166e+00 1.63335741e+02 1.55001322e+00 3.57452863e+00 7.05226026e+01
1716.lowfreq: -9.6475 -0.2476 -0.0020 -0.0016 0.0002 6.0582 31.9324 71.7417 77.1616
frequency: 31.8921 71.7361 77.1611 96.5641 113.3934 144.7922 171.8531 198.6160 206.3397 253.8341 277.8639 288.0020 302.1075 322.7038 344.8402 365.6208 376.8821 387.0336 439.7330 475.2538 534.2101 551.9729 564.0275 623.1173 649.2198 669.4347 696.2541 742.7772 759.8698 776.9081 810.9068 830.7345 881.9299 883.2638 965.1003 978.5509 981.4474 997.4241 1019.0271 1040.4824 1076.0081 1126.4499 1144.5386 1172.3669 1177.7449 1263.5427 1318.7946 1357.3545 1376.8966 1428.2573 1470.2886 1503.2140 1570.3881 1586.9317 1607.9912 3143.7211 3155.8572 3166.7758 3175.5830 3178.1908 3354.6120 3564.6000 3614.1047
redmass: 7.4975 6.6280 8.4645 5.9626 7.2569 8.0221 2.6502 6.2907 6.6462 4.0058 1.9161 3.1891 3.7621 7.3244 5.9668 3.3644 5.4485 2.9912 4.2519 5.2546 4.9810 1.5622 2.9409 8.3211 8.0128 3.2332 7.0405 4.0213 8.0207 1.2872 1.2856 7.0881 1.5041 5.0298 1.3976 1.6668 4.1548 1.3443 1.2731 2.2284 3.7889 3.5819 2.0763 1.4663 1.7012 1.4746 1.8632 1.7115 7.0493 2.3656 2.5288 6.1288 1.9622 3.2637 6.9057 1.0862 1.0903 1.0952 1.0624 1.1010 1.0920 1.0661 1.0667
irintensity: 8.3322 0.6824 5.0730 1.2526 1.4446 2.1320 35.4533 2.2204 6.9885 35.3608 33.1052 13.1518 32.3783 71.8645 17.3281 54.3963 72.3725 23.1611 5.2294 30.6799 4.3304 60.8664 18.2735 8.8858 20.8270 74.3899 152.0359 23.9904 209.8915 54.0317 242.9662 98.6538 4.6381 56.2122 5.0827 101.2463 59.3911 0.7596 81.2709 4.4264 100.7281 159.5462 15.5217 18.6465 26.6827 11.9530 3.2334 203.0524 24.8067 25.5521 14.9328 157.9403 0.7889 40.7072 10.2685 2.0335 7.6421 3.0676 16.4405 12.5673 500.3598 93.1158 95.3803
temp: 298.150 k
press: 1.00000 atm
elementType: 15 8 8 8 8 8 8 7 6 6 6 6 6 6 6 1 1 1 1 1 1 1 1
symmnumber: 1
zpe: 403363.4 jmol-1
zpe.correction: 0.153633 hartree
zpe.thermalcorrener: 0.168813 hartree
zpe.thermalcorrenthalpy: 0.169757 hartree
zpe.thermalcorrgfe: 0.111076 hartree
zpe.sumelectzpe: -1117.700876 hartree
zpe.sumelectthermal: -1117.685696 hartree
zpe.sumelectthermalent: -1117.684752 hartree
zpe.sumelectthermalfe: -1117.743433 hartree
dipole: 0.8235 -1.3471 -0.9862
dipole: 1.8615
quadrupole: -101.0367 -94.2596 -90.2097
quadrupole: 17.7903 2.3538 -2.3186
quadrupole: -5.8680 0.9091 4.9590 17.7903 2.3538 -2.3186
hfenergy: -1117.8545094 hartree
pointgroup: C01 [X(C7H8N1O6P1)]
dipole: 0.4957868 0.4039786 0.3569132 debye
dipolederiv: 2.1421073 -0.4236789 -0.1173067 -0.306288 1.9435767 0.0186354 0.1695382 -0.2338825 2.0089875 -1.1859281 0.6696416 -0.1686467 0.6315602 -1.0289776 0.1005123 -0.1088112 0.110464 -0.461549 -0.812606 -0.0548452 0.2566975 -0.0166642 -0.8164179 0.1570133 0.0907118 0.228012 -0.8900741 -0.5048789 0.076561 0.0910489 0.2593705 -0.9848482 -0.1885866 0.238583 -0.2306213 -0.7545595 -0.9787969 0.0538764 -0.2820482 -0.2034898 -0.5607941 0.0139792 -0.1331622 0.1054325 -0.4909493 -0.7306765 0.086878 -0.023393 0.0169299 -0.5258722 0.0137881 -0.1119392 0.0466072 -0.592768 -0.3040571 -0.3550237 0.162446 -0.1461797 -0.7589925 0.1192969 0.0552579 0.0166279 -0.3293046 -0.4262382 0.5233451 -0.2614978 0.3472846 -0.0166513 0.001042 -0.1727447 0.0654323 -0.385148 -0.2155333 -0.000384 -0.0404199 0.0148686 -0.1558722 0.0381639 -0.0789272 -0.0278383 0.0206365 0.6461925 -0.2959985 0.0376165 -0.7126024 0.7710643 -0.1811706 -0.0819733 0.0719504 0.0034114 0.0352447 -0.0389223 -0.0182309 0.0195054 -0.0553853 0.0033946 0.0196523 -0.0226338 -0.1070962 -0.0179918 -0.0177038 -0.0207592 0.0855076 -0.2966376 0.0401583 0.0187749 0.0129661 -0.1236598 0.0343023 0.0196768 -0.0143615 0.0498059 0.106303 -0.0106888 -0.0076083 -0.026381 -0.1246586 -0.0580853 -0.0976524 0.0055818 -0.1112167 0.0746405 -0.0086985 0.0126623 -0.0077904 -0.1540452 1.0210972 -0.0676709 0.4242807 0.0483352 0.7515768 -0.2539088 0.3021989 -0.2472352 0.4464054 -0.0332291 0.0109263 0.0132424 0.0133663 0.1050009 -0.0072688 0.0078441 -0.0049677 0.1575272 0.00237 0.0151173 0.0111677 -0.0042852 0.1264183 0.0052937 0.0079449 0.0157979 0.1525209 0.0480132 -0.0801967 0.0141591 -0.061708 -0.0577847 0.0296478 0.009201 0.0239514 0.1555129 0.0375805 0.0896569 -0.0032306 0.0770538 -0.0570755 0.0178426 -0.006759 0.0149072 0.1601245 0.6245929 -0.1297927 0.1082729 -0.049347 0.2287385 0.0583308 0.1373834 0.0369272 0.3515807 0.2264073 -0.0385282 -0.0410551 -0.0166357 0.3870023 0.0189143 -0.1207887 0.0057521 0.2984043 0.1937874 -0.0012391 -0.068651 -0.0858231 0.4252916 -0.0289119 -0.1438767 0.0199815 0.3393586 0.2563257 0.0559572 -0.0649129 0.1506519 0.3956962 0.043221 -0.1031621 0.0265405 0.3193425 unknown
polarizability: 149.8554968|1.4441959|163.7873932|8.562837|-18.5283215|75.0258755 unknown
InChI: InChI=1S/C7H8NO6P/c9-7(8-10)5-3-1-2-4-6(5)14-15(11,12)13/h1-4,8,10-12H
charge 0 multiplicity 1
23 atoms
P  2.280522 -0.856616 0.652255
O  1.067843 -0.37445 -0.480821
O  1.174127 -1.554632 1.79507
O  2.928522 -2.149489 -0.240305
O  -3.12601 -0.607509 -0.509972
O  3.348299 0.133386 1.254942
O  -2.238058 -2.690194 0.777792
N  -1.379183 -1.554752 0.602592
C  -1.105939 0.751477 -0.256702
C  0.304941 0.835511 -0.381476
C  -1.841256 1.96493 -0.339077
C  0.972621 2.068015 -0.530815
C  0.219639 3.260496 -0.568084
C  -1.191807 3.206227 -0.485195
C  -1.911219 -0.499816 -0.085135
H  2.062908 2.085815 -0.626632
H  -2.932336 1.89449 -0.289366
H  0.733271 4.220885 -0.679207
H  -1.781517 4.126935 -0.535495
H  -0.483006 -1.646855 1.106325
H  1.5216 -1.745175 2.701628
H  2.31218 -2.551002 -0.907827
H  -3.072141 -2.362676 0.296107
