program: Gaussian 09
title: 000191396
version: EM64L-G09RevD.01
frameworkgroup: C1[X(C9H8N6O)]
method: RPBEPBE
basis: SDD
operation: Freq
keyword: #pfreq=noraman
keyword: PBEPBE/SDD
title: #p freq=noraman PBEPBE/SDD
converged: YES YES NO NO
title: Mulliken charges:
elementType: O N N N N N N C C C C C C C C C H H H H H H H H
charge: -0.226525 -0.165900 -0.043865 -0.092466 -0.022836 -0.069831 -0.603956 -0.503673 0.157647 0.390577 -0.130860 0.216078 -0.388561 -0.252509 -0.165008 -0.338958 0.263784 0.259745 0.264324 0.255082 0.261119 0.247819 0.349543 0.339231
chargesum: 0.00000
title: Mulliken charges with hydrogens summed into heavy atoms:
elementType: O N N N N N N C C C C C C C C C
charge: -0.226525 -0.165900 -0.043865 -0.092466 -0.022836 -0.069831 0.084818 0.019856 0.157647 0.390577 -0.130860 0.216078 -0.124237 0.002573 0.096111 -0.091139
polarizability: 1.86446195e+02 1.01145589e+01 1.36069126e+02 -1.03035980e+01 6.77987705e-01 8.99676529e+01
1716.lowfreq: -6.8582 -0.0006 -0.0002 0.0006 3.1661 8.6596 21.1070 32.0860 46.8804
frequency: 20.4629 31.3912 46.8575 114.5294 171.9011 178.6742 232.8693 269.9442 280.4117 314.5842 341.3015 503.7204 525.9006 534.4380 550.1445 557.5017 568.6160 594.1559 621.4006 649.2332 670.5815 691.6866 725.1999 734.3414 747.0485 805.5230 829.1771 842.7599 868.6910 874.8353 883.3109 905.5196 939.6989 960.7896 981.7014 1023.1154 1045.8374 1048.9672 1135.7005 1157.4374 1182.8133 1206.2980 1220.3516 1235.4319 1277.4197 1294.4722 1322.3235 1355.2317 1367.7647 1375.3390 1420.6301 1445.4711 1448.6175 1483.9334 1545.9212 1576.5996 1594.1821 1635.0381 3030.3959 3097.5023 3169.2877 3221.7737 3236.5657 3269.5805 3534.7506 3689.1884
redmass: 5.1516 5.8605 5.5276 6.2263 4.4327 7.8051 6.8845 5.2140 4.0441 2.7436 3.9710 9.1847 4.9932 1.1731 3.9033 1.1790 5.4715 3.0343 5.0948 8.7092 9.1987 7.9050 5.7816 1.3414 3.8960 11.5208 1.3722 3.6319 7.4377 5.5573 1.3909 4.5177 1.4427 2.4208 2.4713 1.5336 5.2032 3.7042 1.5738 4.5129 5.2617 3.2635 2.2653 2.7913 2.2568 2.5547 6.6157 1.3961 2.1534 1.7088 2.7561 1.9252 2.0093 5.0434 8.2540 2.0345 6.8093 2.3797 1.0600 1.1034 1.0923 1.0924 1.0993 1.1085 1.0446 1.1056
irintensity: 0.4836 0.6410 1.5574 5.6043 6.5391 2.3831 1.7414 1.5166 7.7536 1.6671 4.0786 1.9712 9.2386 196.9631 4.2031 75.1853 8.4665 6.7691 5.4154 6.5656 24.9553 6.4611 33.7516 66.2130 34.2287 9.2230 31.2014 16.2729 22.0180 4.4342 1.1426 28.5404 11.2028 5.1351 29.4087 41.0428 2.9303 0.8325 17.5960 18.9779 1.4433 11.2328 5.9908 59.8177 15.7838 34.5954 124.9799 14.5775 15.6103 9.4095 16.2369 54.1924 5.2125 8.2094 119.6552 49.3029 2.2720 555.3784 11.2955 2.1898 14.9708 3.8171 0.0233 0.3271 138.8885 52.6317
temp: 298.150 k
press: 1.00000 atm
elementType: 8 7 7 7 7 7 7 6 6 6 6 6 6 6 6 6 1 1 1 1 1 1 1 1
symmnumber: 1
zpe: 455878.0 jmol-1
zpe.correction: 0.173635 hartree
zpe.thermalcorrener: 0.186215 hartree
zpe.thermalcorrenthalpy: 0.187159 hartree
zpe.thermalcorrgfe: 0.132267 hartree
zpe.sumelectzpe: -750.311958 hartree
zpe.sumelectthermal: -750.299377 hartree
zpe.sumelectthermalent: -750.298433 hartree
zpe.sumelectthermalfe: -750.353325 hartree
dipole: -0.2372 -0.6689 -0.4557
dipole: 0.8434
quadrupole: -69.6839 -97.7831 -86.3902
quadrupole: -5.2678 -3.3072 -0.3082
quadrupole: 14.9351 -13.1640 -1.7711 -5.2678 -3.3072 -0.3082
hfenergy: -750.4855924 hartree
pointgroup: C01 [X(C9H8N6O1)]
dipole: -0.0777466 0.215037 0.2404432 debye
dipolederiv: -0.4193966 0.1989342 0.1332824 0.1894854 -0.4845614 0.0160991 0.1604261 -0.0208009 -0.2250298 -0.663709 0.1241948 0.0761879 -0.279016 -0.3568163 -0.1656476 -0.2738303 -0.0693554 -0.2256427 -0.0600156 0.30013 0.1525514 0.5761633 0.0660321 0.2321147 0.3108464 0.2505761 -0.0018727 -0.4393694 -0.2202479 -0.1071657 -0.1055337 -0.0513976 -0.0015364 -0.1755809 -0.0398591 -0.2116491 -0.8179714 0.1978501 -0.1296652 0.4221544 -0.5872895 -0.0846966 -0.0814248 -0.1107755 -0.2899062 -0.6726749 0.0035861 -0.1445123 -0.4805025 -0.7002369 -0.4063662 -0.409668 -0.2068997 -0.4981289 -1.1156404 -0.4039279 -0.3257211 -0.600649 -0.4421792 -0.141093 -0.4685749 -0.0751619 -0.8779265 1.0599674 0.0113166 -0.0095355 0.1953572 0.1194804 -0.0548905 0.1514875 -0.0395523 0.338007 0.5383679 -0.2592094 -0.0235204 -0.5015705 0.4360235 0.0677219 -0.035417 0.0388106 0.1535423 0.053521 -0.1116857 -0.1045868 -0.0444424 0.3121168 -0.0942997 -0.0563796 -0.0264567 -0.1023299 -0.5590502 -0.080742 -0.2396908 0.160083 -0.1554959 -0.0149135 -0.2068688 -0.1301802 -0.063592 1.3636406 0.273652 0.5475808 0.5417741 0.6916615 0.4270728 0.7397348 0.3221025 0.6826134 -0.1323227 0.0583113 -0.066786 -0.0165237 -0.0123177 -0.052165 -0.0714458 -0.0620608 -0.1001963 -0.0971425 -0.024674 -0.1092317 -0.0422516 -0.1302883 -0.0248524 -0.085329 -0.0044852 -0.104462 0.076617 -0.1611352 -0.1522181 -0.1938618 0.1733491 0.0353642 -0.093196 0.0134068 -0.0258735 0.9312016 -0.1029584 0.3282211 -0.0248013 0.5012594 0.2631178 0.4214082 0.2047816 0.2146199 0.0088143 0.0104263 0.054753 -0.0317221 0.0498524 -0.0852908 -0.0008717 -0.0247536 0.081 -0.0387563 0.0126907 -0.0230247 0.0247871 0.0109265 0.1258131 -0.0257348 0.0410791 0.0606525 0.181289 -0.010197 0.0322466 -0.0021202 0.0018034 0.0579928 0.0304123 0.0535709 0.1429413 0.0350977 0.0396468 0.1057853 0.0458133 0.1242156 -0.0097804 0.1220707 -0.0038697 0.1185673 0.1276509 0.009428 0.0645427 -0.0060252 0.0401818 0.0663344 0.078369 0.0511126 0.1471289 0.0871231 0.0333042 0.0010615 0.0351034 -0.0474879 -0.0684663 -0.0007286 -0.0620221 0.0943204 0.2381558 0.0630299 -0.0425227 0.1305401 0.240762 -0.0126575 -0.004606 -0.0356406 0.3557811 0.3146029 0.0382763 -0.0180318 0.0077587 0.2004063 -0.0749749 -0.0250991 -0.0635663 0.3374357 unknown
polarizability: 185.1209882|-15.1084408|134.4264749|6.6989881|11.521199|92.935511 unknown
InChI: InChI=1S/C9H8N6O/c10-8-7-9(12-5-11-8)15(14-13-7)4-6-2-1-3-16-6/h1-3,5H,4,10H2
charge 0 multiplicity 1
24 atoms
O  -2.697207 -1.055418 0.25705
N  -0.081121 0.621832 -0.6091
N  0.196299 1.851263 0.056814
N  1.43785 1.76503 0.574467
N  1.164013 -1.490685 -1.010616
N  3.400377 -1.409036 0.02653
N  4.200189 0.456894 1.229392
C  -1.382875 0.389712 -1.269132
C  0.998639 -0.230987 -0.505775
C  -2.527168 0.224387 -0.319346
C  1.953669 0.504539 0.248736
C  3.202197 -0.140829 0.514038
C  -3.511903 1.07594 0.153856
C  -4.339698 0.311882 1.064625
C  -3.815589 -0.968831 1.103149
C  2.392337 -1.99739 -0.694964
H  -1.251492 -0.518818 -1.883423
H  -1.583523 1.246094 -1.933279
H  -3.622124 2.127385 -0.104072
H  -5.205998 0.669951 1.616899
H  -4.080641 -1.883072 1.626418
H  2.605463 -3.005225 -1.063409
H  4.075418 1.396319 1.601443
H  5.066991 -0.055334 1.383499
