program: Gaussian 09
title: 000191382
version: EM64L-G09RevD.01
frameworkgroup: C1[X(C9H5F3N2O2)]
method: RPBEPBE
basis: SDD
operation: Freq
keyword: #p
keyword: freq=noraman
keyword: PBEPBE/SDD
title: #p freq=noraman PBEPBE/SDD
converged: NO NO NO NO
title: Mulliken charges:
elementType: F F F O O N N C C C C C C C C C H H H H H
charge: -0.161382 -0.164427 -0.164614 -0.183449 -0.182500 -0.415555 -0.404289 0.375714 0.341687 0.346711 -0.479702 -0.358069 -0.388308 0.053656 0.055850 0.255916 0.266974 0.245199 0.273948 0.344694 0.341945
chargesum: 0.00000
title: Mulliken charges with hydrogens summed into heavy atoms:
elementType: F F F O O N N C C C C C C C C C
charge: -0.161382 -0.164427 -0.164614 -0.183449 -0.182500 -0.070861 -0.062344 0.375714 0.341687 0.346711 -0.212728 -0.112870 -0.114360 0.053656 0.055850 0.255916
polarizability: 2.07087903e+02 1.14048332e+01 1.21910610e+02 -1.47793955e-02 -2.30104878e-03 5.26294062e+01
1716.lowfreq: -22.6592 -0.0006 -0.0005 0.0010 1.8433 9.2617 14.4220 57.7419 89.4176
frequency: -21.7818 57.7258 89.4026 125.8955 132.3011 219.7952 253.4070 273.8658 277.5707 333.2371 376.7857 379.7055 417.6103 432.6306 456.1859 478.4977 485.9531 524.1935 580.1675 602.3454 631.4741 654.7350 698.1435 698.7480 735.1709 748.3208 749.3690 773.3001 829.1914 854.8584 879.8173 920.3496 952.6514 984.9507 1012.6990 1053.4468 1153.6692 1169.4157 1217.3081 1250.4806 1273.4048 1299.3303 1323.6355 1368.1509 1399.3088 1446.8180 1484.4468 1526.2499 1611.3625 1630.7136 1641.7210 1647.7233 3146.1921 3148.6523 3185.9533 3497.2385 3499.9062
redmass: 11.6526 11.7520 7.5060 11.9862 8.8487 5.5952 11.6152 12.0444 5.7327 14.8876 9.0306 6.7331 3.8903 8.9343 3.6038 9.3846 7.2276 10.7716 8.1300 8.0550 4.8402 8.7680 1.3972 7.2062 3.2422 8.4112 1.4499 4.6209 1.4391 3.8738 1.5803 6.3670 1.4136 8.3784 5.8142 4.2041 1.7067 3.5396 1.9332 2.2750 2.5502 2.9976 3.1146 1.6897 5.7061 2.6043 3.7756 3.4806 7.4002 5.9876 7.4340 6.2774 1.0910 1.0928 1.0953 1.0767 1.0767
irintensity: 0.0301 4.6617 1.1643 5.0093 1.7625 0.0400 7.2305 0.8131 1.9648 2.8058 2.0096 4.8569 4.0112 0.4643 9.3640 10.7465 0.7833 0.7048 0.3479 20.8881 1.9689 5.8497 0.3875 3.1496 5.6476 9.2004 167.7500 0.0389 102.9805 0.2854 48.5594 49.6902 12.5282 215.2262 194.2247 126.1346 4.3759 49.6870 263.4106 23.4377 2.4493 37.4310 317.7817 38.0833 61.9973 0.9962 40.3740 9.3811 36.0518 129.8391 98.8137 682.5771 5.0895 0.6787 0.6487 52.5850 11.5965
temp: 298.150 k
press: 1.00000 atm
elementType: 9 9 9 8 8 7 7 6 6 6 6 6 6 6 6 6 1 1 1 1 1
symmnumber: 1
zpe: 350483.0 jmol-1
zpe.correction: 0.133492 hartree
zpe.thermalcorrener: 0.145472 hartree
zpe.thermalcorrenthalpy: 0.146416 hartree
zpe.thermalcorrgfe: 0.094929 hartree
zpe.sumelectzpe: -904.345852 hartree
zpe.sumelectthermal: -904.333872 hartree
zpe.sumelectthermalent: -904.332928 hartree
zpe.sumelectthermalfe: -904.384415 hartree
dipole: 2.6321 2.7865 -0.0065
dipole: 3.8330
quadrupole: -138.0635 -78.1232 -92.1242
quadrupole: -4.7793 -0.0085 0.0068
quadrupole: -35.2932 24.6471 10.6461 -4.7793 -0.0085 0.0068
hfenergy: -904.4793441 hartree
pointgroup: C01 [X(C9H5F3N2O2)]
dipole: -1.0468032 1.0855252 0.0011723 debye
dipolederiv: -0.7732359 0.2466865 0.0045739 0.2011147 -0.5477063 -0.0047809 0.0023332 -0.0046136 -0.2837438 -0.6445338 -0.1441018 -0.1237801 -0.3136213 -0.4651048 -0.2530089 -0.2080696 -0.2232848 -0.6388737 -0.6377362 -0.1445927 0.1196862 -0.3149286 -0.4755215 0.2577761 0.1971615 0.2258138 -0.6290974 -0.9969672 0.3094901 -0.000624 0.678465 -0.775106 0.0007611 0.0000844 0.0000567 -0.3313049 -1.3681579 -0.0736868 0.0010125 -0.3911761 -0.4460547 0.0004682 0.0002254 0.0001333 -0.3307715 -1.1324736 0.5705521 -0.0004704 -0.0325145 -0.3185264 0.0001023 0.0007103 -0.0000729 -0.3055699 -1.309376 -0.181316 0.0006185 0.4698357 -0.2563417 -0.0002089 -0.0004346 0.0001319 -0.3014244 0.2645454 -0.5114776 0.0010415 -0.7142172 0.3080058 -0.0002489 0.0010246 -0.0003053 0.0942733 0.8805228 0.2784642 -0.0010002 0.4591238 -0.0007266 0.0000337 -0.0013324 -0.0000499 0.0949638 -0.7159553 -0.164186 0.0006312 0.1034945 -0.0703806 0.0000958 0.0049092 0.0011427 -0.1675838 0.1817479 0.2155411 -0.0006693 -0.0865376 0.0091124 -0.000367 -0.0013355 -0.0011139 -0.1268328 -0.1296014 -0.0734275 0.0000659 0.046119 0.1351047 -0.0004092 -0.0001319 -0.0003404 -0.1620974 -0.084777 0.0616994 -0.0000818 -0.0006595 0.0298648 -0.0002249 -0.000718 -0.0002581 -0.113646 1.6083631 -0.6062102 0.0006555 -0.5739273 0.6989734 -0.0008093 -0.0005692 0.0000933 0.2423745 1.9467112 0.0666396 -0.001195 -0.0673188 0.427894 -0.0004197 0.0001791 -0.0002211 0.2452109 2.4328664 0.1448893 -0.0007851 0.5107711 1.4130062 -0.0000273 0.0053465 0.0015901 1.5541946 0.1078569 0.0050938 -0.0000103 -0.0131405 -0.0188775 0.0002852 0.0002649 0.0005627 0.1657493 0.0586383 -0.0759922 0.0001958 -0.0459677 -0.043009 0.0003029 0.0002585 0.0003509 0.168563 0.059574 0.0588954 -0.0000468 0.0539741 0.0623559 0.000147 -0.0000051 0.0000149 0.1668732 0.114267 -0.0262966 0.0001062 -0.0056665 0.1785723 0.000262 -0.0000121 0.0002092 0.3291046 0.1377212 0.0433358 0.0000758 0.0367777 0.1544655 0.0002709 0.0001107 0.0001604 0.3296384 unknown
polarizability: 207.3144759|-10.5223708|121.6839041|-0.0221322|-0.0932773|52.6295394 unknown
InChI: InChI=1S/C9H5F3N2O2/c10-9(11,12)4-1-2-5-6(3-4)14-8(16)7(15)13-5/h1-3,13-14H
charge 0 multiplicity 1
21 atoms
F  -4.244944 0.75236 0.016184
F  -3.6342 -1.106576 -1.137939
F  -3.626037 -1.133535 1.122158
O  3.788184 -1.931078 0.001564
O  4.437847 0.886738 -0.002654
N  1.538051 -1.337632 0.00239
N  2.156803 1.340711 -0.00286
C  0.479307 -0.41209 0.001063
C  0.801387 0.977642 -0.001371
C  -1.892145 0.152957 0.001369
C  -0.86918 -0.820371 0.002312
C  -0.233949 1.940369 -0.002103
C  -1.579928 1.532646 -0.000844
C  2.909699 -1.034948 0.001607
C  3.256673 0.464491 -0.002358
C  -3.319211 -0.313233 0.000725
H  -1.119406 -1.886986 0.004766
H  0.014445 3.007185 -0.003757
H  -2.381511 2.275206 -0.001275
H  1.320773 -2.340418 0.004102
H  2.403445 2.336761 -0.004576
