program: Gaussian 09
title: 000191393
version: EM64L-G09RevD.01
frameworkgroup: C1[X(C17H18N2O2)]
method: RPBEPBE
basis: SDD
operation: Freq
keyword: #p
keyword: freq=noraman
keyword: PBEPBE/SDD
title: #p freq=noraman PBEPBE/SDD
converged: YES YES NO NO
title: Mulliken charges:
elementType: O O N N C C C C C C C C C C C C C C C C C H H H H H H H H H H H H H H H H H H
charge: -0.263319 -0.208186 -0.110343 -0.405658 -0.148416 0.189619 -0.612305 0.413787 -0.182820 0.381045 -0.397837 -0.499446 0.359986 0.228702 -0.457415 -0.452840 -0.650295 -0.365446 -0.210079 -0.538573 -0.235441 0.224966 0.226095 0.266433 0.229894 0.257045 0.206948 0.223394 0.265912 0.189179 0.223921 0.253032 0.305571 0.229942 0.218872 0.230535 0.232129 0.210740 0.170669
chargesum: 0.00000
title: Mulliken charges with hydrogens summed into heavy atoms:
elementType: O O N N C C C C C C C C C C C C C C C C C
charge: -0.263319 -0.208186 -0.110343 -0.100087 0.076550 0.189619 -0.119777 0.413787 -0.182820 0.381045 -0.167943 -0.035452 0.359986 0.228702 -0.234021 -0.186928 0.015837 -0.135504 0.008793 0.134830 -0.064771
polarizability: 2.72172316e+02 -3.50602964e+00 2.22485334e+02 -1.80117711e+00 2.64377501e+00 1.29503527e+02
1716.lowfreq: -7.2999 -5.1447 -0.0001 0.0007 0.0007 7.7481 42.7693 59.0340 71.6672
frequency: 42.7594 58.9955 71.6553 93.4236 110.9557 130.4627 148.3937 179.2281 199.4062 205.3525 222.4364 231.4455 252.1260 263.6658 294.4802 298.3902 313.5120 339.7860 350.7197 407.7007 421.4388 446.7626 468.6562 485.5567 497.7717 504.7405 542.6713 568.9176 578.7325 595.2073 622.6099 631.5962 673.3781 709.6446 737.2964 751.6006 772.4277 786.2764 792.9145 829.1699 836.8174 879.2705 887.0074 902.1188 927.7597 951.8454 958.4916 986.8965 1000.1315 1002.1265 1025.5026 1042.4760 1055.8341 1074.0074 1086.2164 1103.8404 1111.6110 1112.5932 1148.3903 1153.5273 1167.6100 1185.9149 1199.5636 1213.8265 1216.4264 1238.4406 1245.7482 1251.7287 1281.7630 1292.3131 1320.7660 1333.1050 1347.5524 1360.5605 1374.1644 1407.0761 1409.7167 1416.6703 1428.9134 1435.7301 1448.0608 1455.2961 1460.9610 1462.0664 1478.9579 1479.7903 1484.5969 1498.0949 1566.1748 1594.0301 1610.4819 1625.3143 1651.7645 2808.4743 2819.1336 2853.8065 2861.2840 2945.1232 2997.5101 3020.9774 3027.6179 3032.3992 3060.3551 3094.1865 3094.5199 3098.1974 3124.8078 3138.3425 3157.6723 3219.6885 3613.6024
redmass: 5.6844 3.6171 2.7816 3.7142 2.8571 2.9397 4.8231 2.6147 3.0030 2.4906 1.8801 2.6006 2.8807 2.3023 4.5563 3.5844 3.4204 2.8489 3.3631 2.8514 4.5301 3.1371 3.9436 4.0478 1.9196 1.6897 3.2933 4.6836 3.8792 3.9060 3.4217 5.0573 6.0731 4.5871 4.0703 1.6339 2.3737 4.1079 1.6721 2.7772 4.1027 1.9867 1.5349 3.1608 3.4166 1.3588 1.6028 2.1735 7.7563 3.1679 2.7039 2.3033 2.1824 2.8261 2.3291 2.6045 1.2691 1.3245 1.8600 1.7094 1.5525 1.3027 2.2570 1.4462 1.6166 1.7458 2.3891 2.4692 1.8787 1.8862 1.4747 1.4592 2.1838 1.3228 1.3929 2.3076 2.2245 3.3547 1.1387 1.1687 1.2240 1.4492 1.0892 2.0423 1.0580 1.0527 1.0659 3.1358 6.8581 7.9585 7.8233 7.5086 7.4237 1.0719 1.0791 1.0585 1.0851 1.0326 1.0597 1.0843 1.1028 1.0730 1.1012 1.0930 1.0955 1.0976 1.0856 1.0914 1.0983 1.0983 1.0809
irintensity: 1.1203 1.8933 2.9454 6.7946 1.2824 4.1319 3.1541 4.6717 10.4693 5.9375 2.3472 4.3756 11.0379 5.7876 3.2616 13.2144 0.4355 1.0490 10.3610 2.0784 2.5837 2.4352 2.5578 5.4323 39.4377 66.5381 1.5198 1.8153 0.1762 4.8478 2.5583 7.7113 50.9685 6.8779 5.8532 69.9426 16.5822 21.8769 11.1974 2.0581 10.6700 29.4161 2.0266 8.1139 6.3036 0.1926 11.3876 6.0962 72.3101 17.8900 11.8457 13.1314 20.3592 4.6172 12.3681 11.9974 1.3248 8.0316 32.0787 32.7285 17.6392 26.0422 9.0443 30.0345 7.6307 1.0175 6.8456 53.5539 6.3786 32.7639 6.3867 5.0826 22.3649 2.8350 1.4493 7.3198 35.6901 15.3178 2.1601 1.9273 15.8502 14.2829 1.4756 22.7530 7.1865 14.7398 21.9687 1.8572 1.3057 301.0366 1.6533 7.2054 38.9988 45.7678 70.2537 187.3015 86.7974 76.9804 24.6753 9.8096 46.7591 46.0540 17.7587 17.3865 15.6780 21.1557 2.9737 20.5957 32.2631 1.3779 71.0011
temp: 298.150 k
press: 1.00000 atm
elementType: 8 8 7 7 6 6 6 6 6 6 6 6 6 6 6 6 6 6 6 6 6 1 1 1 1 1 1 1 1 1 1 1 1 1 1 1 1 1 1
symmnumber: 1
zpe: 824164.9 jmol-1
zpe.correction: 0.313908 hartree
zpe.thermalcorrener: 0.332235 hartree
zpe.thermalcorrenthalpy: 0.333179 hartree
zpe.thermalcorrgfe: 0.268575 hartree
zpe.sumelectzpe: -916.993907 hartree
zpe.sumelectthermal: -916.975580 hartree
zpe.sumelectthermalent: -916.974635 hartree
zpe.sumelectthermalfe: -917.039240 hartree
dipole: -5.9790 0.7728 -0.0081
dipole: 6.0288
quadrupole: -126.3728 -107.5065 -127.1894
quadrupole: 0.8784 9.1618 -5.9286
quadrupole: -6.0166 12.8498 -6.8332 0.8784 9.1618 -5.9286
hfenergy: -917.3078149 hartree
pointgroup: C01 [X(C17H18N2O2)]
dipole: 2.3561771 0.2706626 -0.0324742 debye
polarizability: 272.1904185|2.7027855|222.2454659|-3.7099832|-4.5961085|129.7252929 unknown
InChI: InChI=1S/C17H18N2O2/c1-19-9-11(10-20)7-17(21-2)13-4-3-5-14-16(13)12(8-18-14)6-15(17)19/h3-5,7-8,10,15,18H,6,9H2,1-2H3
charge 0 multiplicity 1
39 atoms
O  -0.436009 -0.081229 -1.903971
O  -5.05897 -1.185244 1.198588
N  -2.020389 1.641218 -0.138494
N  3.962588 0.954065 0.504082
C  -0.65146 1.163526 0.172255
C  -0.46944 -0.29338 -0.412242
C  0.462947 2.12323 -0.342476
C  0.876301 -0.868838 0.03972
C  1.906803 0.091327 0.152343
C  1.806047 1.514028 -0.019775
C  -1.650452 -1.155555 -0.04073
C  -3.054416 0.851144 0.553402
C  -2.832786 -0.634389 0.404589
C  3.250635 -0.252402 0.48357
C  1.226342 -2.212474 0.281985
C  3.083383 2.022549 0.204887
C  -2.26327 3.087214 0.002675
C  3.605809 -1.601604 0.716803
C  2.573547 -2.562074 0.614215
C  -0.262917 -1.287564 -2.7183
C  -3.930904 -1.554188 0.766478
H  -0.510312 1.063174 1.283025
H  0.357297 3.114498 0.132095
H  0.332541 2.24516 -1.434381
H  -1.554687 -2.246638 -0.136609
H  -4.050492 1.106477 0.145757
H  -3.107539 1.084644 1.651853
H  0.480495 -3.013053 0.228989
H  3.44867 3.047895 0.182919
H  -2.093438 3.475161 1.039613
H  -3.314595 3.294862 -0.265802
H  -1.627341 3.658456 -0.691957
H  4.952976 1.05697 0.712415
H  4.627111 -1.905763 0.970803
H  2.813979 -3.615836 0.795244
H  0.651168 -1.849428 -2.441463
H  -0.167597 -0.919529 -3.752504
H  -1.142302 -1.959898 -2.656017
H  -3.694919 -2.641311 0.629611
