program: Gaussian 09
title: 000191363
version: EM64L-G09RevD.01
frameworkgroup: C1[X(C6H11NO3)]
method: RPBEPBE
basis: SDD
operation: Freq
keyword: #p
keyword: freq=noraman
keyword: PBEPBE/SDD
title: #p freq=noraman PBEPBE/SDD
converged: YES YES NO NO
title: Mulliken charges:
elementType: O O O N C C C C C C H H H H H H H H H H H
charge: -0.446820 -0.424721 -0.238547 -0.366308 -0.102020 -0.149102 -0.462980 -0.197879 -0.675610 0.212561 0.222585 0.256966 0.217201 0.231148 0.272720 0.278144 0.224288 0.228416 0.197388 0.344277 0.378292
chargesum: 0.00000
title: Mulliken charges with hydrogens summed into heavy atoms:
elementType: O O O N C C C C C C
charge: -0.102543 -0.046428 -0.238547 -0.088164 0.120565 0.107864 -0.014631 0.074841 -0.025517 0.212561
polarizability: 9.00706618e+01 1.56806117e-01 7.39420486e+01 -3.25987809e+00 1.80226914e-02 7.21337978e+01
1716.lowfreq: -4.6260 0.0008 0.0009 0.0009 9.7973 18.7827 26.0176 54.2006 113.9302
frequency: 20.9316 54.1025 113.8864 164.5248 214.5000 230.1762 256.3104 282.9881 339.0840 368.3384 408.5396 436.9432 449.1975 555.7886 586.0888 600.0629 699.7636 745.5408 814.3997 818.5773 908.4323 916.6258 948.2456 986.7429 1017.3368 1057.0250 1068.8660 1092.1367 1111.9902 1139.1790 1199.8147 1208.1040 1233.8945 1269.1845 1295.5157 1301.0442 1309.2724 1334.0002 1347.8051 1380.7441 1392.9599 1413.6540 1460.2910 1470.4283 1477.1631 1659.7426 2976.6499 2986.3522 2991.1066 3009.8715 3028.8121 3074.8087 3077.8037 3090.3516 3513.1817 3545.1349 3580.4898
redmass: 4.0063 8.1626 3.0523 3.5448 2.0633 1.2570 1.2613 3.8300 2.0163 2.0933 3.3954 5.1262 2.6876 2.2799 3.1247 1.7504 3.4683 3.4924 4.1314 3.1080 2.1073 2.2286 1.9136 2.1347 2.2389 2.4828 1.9814 1.6530 1.9880 2.6806 1.5661 1.2950 1.3952 1.3832 1.6176 1.7560 1.5282 1.3283 1.3534 1.2224 1.3185 1.3581 1.0647 1.0855 1.0489 8.5878 1.0367 1.0819 1.0839 1.0649 1.0860 1.1004 1.1027 1.1004 1.0640 1.0778 1.0665
irintensity: 0.5785 1.3017 1.1126 4.4816 18.5954 6.6053 126.5858 0.8742 55.2780 21.3576 6.3305 14.0468 20.7515 39.7649 63.6831 91.1880 57.4875 4.1265 42.1495 0.5610 21.2810 10.5010 18.1648 58.1486 50.2256 6.2670 80.7155 7.3873 61.9651 43.5850 67.9508 11.6347 22.7424 1.8191 24.2534 10.9373 16.9074 7.5936 10.3757 17.6010 2.0451 7.2334 8.4562 9.2449 8.5771 261.5306 26.3551 31.6936 14.6671 38.7423 15.2509 29.5532 45.5323 38.8023 17.8636 6.4435 7.9415
temp: 298.150 k
press: 1.00000 atm
elementType: 8 8 8 7 6 6 6 6 6 6 1 1 1 1 1 1 1 1 1 1 1
symmnumber: 1
zpe: 448806.0 jmol-1
zpe.correction: 0.170941 hartree
zpe.thermalcorrener: 0.181727 hartree
zpe.thermalcorrenthalpy: 0.182671 hartree
zpe.thermalcorrgfe: 0.133692 hartree
zpe.sumelectzpe: -514.844064 hartree
zpe.sumelectthermal: -514.833278 hartree
zpe.sumelectthermalent: -514.832334 hartree
zpe.sumelectthermalfe: -514.881313 hartree
dipole: -3.2099 0.2008 1.5512
dipole: 3.5707
quadrupole: -63.5239 -59.2284 -54.4641
quadrupole: -2.9877 6.9247 3.4268
quadrupole: -4.4518 -0.1563 4.6081 -2.9877 6.9247 3.4268
hfenergy: -515.0150052 hartree
pointgroup: C01 [X(C6H11N1O3)]
dipole: 1.1259844 -0.2508159 0.8017333 debye
dipolederiv: -0.6311675 -0.1935778 0.1651668 -0.1883481 -0.7839474 -0.0370845 0.0984687 -0.1141405 -0.1784764 -0.3757489 -0.0259412 0.0970878 -0.0144427 -0.4083655 -0.2520993 0.0815116 -0.180781 -1.1074045 -0.85641 0.1691107 -0.3641719 0.2871149 -0.4130739 0.106328 -0.1758279 -0.0537089 -0.7334661 -0.7051069 0.0651756 -0.1700897 -0.0093214 -0.6790015 0.0123751 -0.102589 -0.1020715 -0.307989 0.4800588 0.0051184 0.1602589 0.0123379 0.3323193 0.032201 0.3496354 0.0811263 0.4336144 0.4160756 0.225121 -0.0633489 0.1441432 0.6386489 -0.0072321 0.0037451 -0.0292586 0.2114516 -0.1881046 -0.1293612 0.0658564 -0.0464616 -0.1545121 0.0287094 -0.0214976 0.0522135 0.0788848 0.3448493 0.2087182 -0.05674 0.1430863 0.25253 0.0809484 -0.1717169 0.0854797 0.0912444 0.0532927 -0.0213324 -0.0115053 -0.0500343 -0.0554875 -0.1190204 -0.062026 -0.0886542 -0.1113032 1.0617346 -0.4153719 0.2981483 -0.390198 0.4031323 0.1631746 0.1641864 0.2499975 1.3862725 -0.1651633 -0.010713 0.094517 -0.0096699 0.0328678 -0.0098193 0.0991694 0.0055415 -0.0696796 0.0338119 -0.0311095 0.0311217 -0.0290431 0.0004494 -0.0506611 0.0369174 -0.0684633 -0.0862714 -0.0068568 0.0553787 -0.082067 0.0540846 0.0515988 0.054836 -0.1249146 0.0902823 -0.0728269 0.0494967 0.0022969 0.0083008 0.0230697 -0.0354993 -0.0909638 0.0610342 -0.1223599 -0.0421296 -0.0163171 -0.0463358 -0.0342674 -0.0568982 0.002491 -0.0766877 -0.034752 -0.0963202 -0.0358098 0.0615548 -0.0631175 -0.0094819 -0.0275437 0.2904578 0.0056637 -0.0242489 0.071628 0.0645807 0.0977727 -0.029528 -0.0002794 -0.0550864 -0.1538861 0.035128 0.0165249 0.0722903 0.06016 -0.0292897 -0.0064741 0.1295459 -0.0307481 0.0897621 0.020649 0.0961287 -0.0029786 -0.0064206 -0.1319664 0.0451282 -0.1308461 0.0867502 0.0575451 0.0338774 -0.1268287 0.0032517 0.0077557 0.3414589 0.0525065 -0.1110917 0.0046172 0.250563 0.083607 -0.0898018 0.1216428 0.0978332 0.1660251 0.1443082 -0.0161141 0.1525918 0.2814078 -0.0139294 -0.0731187 0.0252829 0.3199798 unknown
polarizability: 88.3292903|-1.9778731|74.213166|5.8448091|-0.8298648|73.604052 unknown
InChI: InChI=1S/C6H11NO3/c1-3-2-4(8)5(7-3)6(9)10/h3-5,7-9H,2H2,1H3
charge 0 multiplicity 1
21 atoms
O  -0.485922 -2.492237 0.008516
O  -1.634011 0.962522 0.939562
O  -2.532885 0.934295 -1.198657
N  0.748152 0.733204 -1.029204
C  1.980476 0.306051 -0.297494
C  0.137822 -1.189907 0.280577
C  1.67467 -1.16744 0.093921
C  -0.374645 -0.204311 -0.802691
C  2.266345 1.213742 0.920223
C  -1.623259 0.588857 -0.41332
H  2.848788 0.352296 -0.984391
H  -0.142077 -0.828199 1.287486
H  2.220651 -1.492886 0.996961
H  1.927028 -1.848112 -0.74073
H  -0.646774 -0.792075 -1.702342
H  0.868906 1.048251 -1.993219
H  2.381239 2.261868 0.593029
H  1.426492 1.178047 1.637168
H  3.193204 0.903765 1.440076
H  -0.356339 -3.085876 0.789221
H  -2.421166 1.549044 1.103911
