program: Gaussian 09
title: 000191314
version: EM64L-G09RevD.01
frameworkgroup: C1[X(C21H16N2O6)]
method: RPBEPBE
basis: SDD
operation: Freq
keyword: #p
keyword: freq=noraman
keyword: PBEPBE/SDD
title: #p freq=noraman PBEPBE/SDD
converged: YES YES NO NO
title: Mulliken charges:
elementType: O O O O O O N N C C C C C C C C C C C C C C C C C C C C C H H H H H H H H H H H H H H H H
charge: -0.302661 -0.273687 -0.442555 -0.487156 -0.520478 -0.308313 -0.512278 -0.496434 0.383917 0.556708 0.029444 -0.632843 -0.385246 -0.292037 0.143275 0.087094 0.084724 0.137988 0.120024 0.240255 0.254155 -0.296289 -0.293478 -0.388645 -0.257751 -0.387804 -0.252335 -0.195735 -0.197345 0.319971 0.314541 0.276187 0.474927 0.409553 0.280336 0.283628 0.222175 0.232785 0.220885 0.236751 0.231694 0.234503 0.381067 0.380661 0.385824
chargesum: 0.00000
title: Mulliken charges with hydrogens summed into heavy atoms:
elementType: O O O O O O N N C C C C C C C C C C C C C C C C C C C C C
charge: -0.302661 -0.273687 -0.061487 -0.106495 -0.134654 -0.308313 -0.037351 -0.086881 0.383917 0.556708 0.029444 -0.312872 -0.070705 -0.015850 0.143275 0.087094 0.084724 0.137988 0.120024 0.240255 0.254155 -0.015953 -0.009850 -0.166470 -0.024967 -0.166920 -0.015585 0.035959 0.037158
polarizability: 4.90614039e+02 4.24999836e+00 3.42179630e+02 8.25746156e-01 3.20216428e+00 1.00316976e+02
1716.lowfreq: -4.7634 -3.6609 -0.0012 -0.0009 -0.0007 1.7416 10.4312 23.9522 28.2971
frequency: 10.3160 23.9417 28.2757 37.3410 41.3518 59.1411 74.6928 99.3937 107.8394 122.5526 136.3291 148.1361 160.2640 162.8311 200.0426 237.0714 249.3853 259.7794 290.4158 300.8222 312.7708 332.4965 334.2543 336.0914 353.8973 377.8889 386.5877 419.3724 433.7677 437.0835 464.0869 504.5397 513.1803 522.1878 525.2146 528.7655 537.6409 550.5317 563.4647 581.8059 591.5670 637.8473 646.7836 654.4415 672.1659 679.6897 690.6722 723.4632 752.3799 754.5886 761.9958 768.0619 770.3108 772.2191 803.2218 812.9679 853.7295 856.4912 861.3768 864.1533 870.9304 878.4864 951.1499 959.1602 961.2106 965.8629 968.9870 998.8149 999.2512 1003.0124 1004.3234 1032.5473 1037.4330 1059.2829 1068.6775 1080.3499 1100.5335 1127.5928 1140.7389 1150.4124 1169.8233 1171.6293 1172.3829 1202.7841 1216.3457 1225.7790 1251.8401 1260.8416 1266.4527 1286.5294 1291.2260 1319.0289 1330.6298 1384.5486 1390.8461 1391.5910 1412.6429 1434.9115 1435.3929 1469.5112 1479.8035 1488.5329 1510.4759 1538.2794 1559.2076 1573.7668 1591.5837 1605.1768 1610.1133 1614.3871 1616.4215 1639.0414 1641.8613 3116.7743 3119.7295 3142.2025 3144.1134 3156.5623 3157.2085 3165.5910 3172.8384 3173.3454 3177.0925 3207.7805 3208.6156 3352.1703 3535.0754 3608.8381 3625.1941
redmass: 5.9697 5.7074 7.3636 6.9734 6.3461 11.4007 8.1732 6.0344 5.1805 6.3657 5.5319 7.0591 7.9827 6.6060 8.2470 5.3108 4.6415 7.1560 5.0475 7.0284 5.0588 1.1518 1.5508 2.7850 7.5835 6.8261 6.3631 8.8834 3.4157 3.5049 2.9488 5.5651 5.9110 5.5776 3.6977 3.5892 7.1183 6.4410 1.2177 6.1714 6.4555 5.3436 6.1349 6.4966 4.1624 4.3298 3.9586 5.4612 2.7401 2.2051 6.3507 1.8278 1.9648 3.3055 6.6692 6.4368 1.1926 1.4637 1.4291 7.2973 1.4521 6.3753 1.4434 1.3547 1.3514 2.5782 1.4037 1.3956 4.5130 1.3333 1.3252 2.6078 2.2938 2.1987 2.6967 2.1901 2.3043 1.6218 1.3860 1.2390 1.0723 1.5904 1.0751 1.9053 2.8951 2.7324 3.0899 1.8204 2.3979 1.6152 1.5173 2.1147 3.3098 6.2675 7.6977 8.3910 4.6835 2.6074 2.5666 2.7288 2.4888 3.0082 3.0484 3.7848 4.5567 5.6848 4.6032 6.8411 6.8561 6.1032 5.9579 2.1767 3.5884 1.0891 1.0883 1.0890 1.0883 1.0930 1.0932 1.0925 1.0996 1.1002 1.0901 1.0912 1.0883 1.0804 1.0641 1.0665 1.0670
irintensity: 0.4322 0.0591 5.4705 2.0057 1.6870 0.0883 4.3994 0.7227 0.7465 0.2566 0.0896 1.2340 3.4454 0.5346 3.2222 0.4024 4.4376 3.0540 0.9623 8.8379 0.0111 54.7430 162.6039 52.6049 2.9826 10.2434 7.8975 39.9770 0.0810 1.0311 48.9485 24.9121 23.2069 2.1215 5.4244 10.9339 7.9056 1.0367 109.4358 12.5077 5.8202 3.1947 22.1503 3.6047 21.8281 3.1886 50.2184 6.6773 22.9981 60.3603 9.3808 42.0350 56.2570 0.2467 4.6361 5.1523 42.2619 0.5506 10.1492 39.5431 36.8210 4.4518 65.6632 4.3197 2.5831 67.6609 133.3911 20.1682 314.7558 0.5480 1.5115 20.1880 16.9560 44.6909 51.9362 164.7576 53.9424 68.2216 66.1156 10.6490 18.5018 115.6152 4.7455 3.3273 26.4537 61.5388 29.0680 62.0472 125.7780 145.2519 72.4480 129.1094 311.5474 57.4832 37.6402 9.5035 283.8418 44.9266 118.9553 160.0191 18.5897 8.5015 1217.0519 376.6233 2.6122 302.5386 244.6548 181.5625 78.6473 76.3468 48.0039 43.9634 311.8199 8.4970 7.6133 11.0273 8.4597 3.5790 8.4155 33.1022 29.8334 29.3140 3.1040 96.9262 88.9823 214.0668 63.0100 51.9703 60.4325
temp: 298.150 k
press: 1.00000 atm
elementType: 8 8 8 8 8 8 7 7 6 6 6 6 6 6 6 6 6 6 6 6 6 6 6 6 6 6 6 6 6 1 1 1 1 1 1 1 1 1 1 1 1 1 1 1 1
symmnumber: 1
zpe: 871293.8 jmol-1
zpe.correction: 0.331858 hartree
zpe.thermalcorrener: 0.356707 hartree
zpe.thermalcorrenthalpy: 0.357651 hartree
zpe.thermalcorrgfe: 0.274359 hartree
zpe.sumelectzpe: -1368.725409 hartree
zpe.sumelectthermal: -1368.700560 hartree
zpe.sumelectthermalent: -1368.699616 hartree
zpe.sumelectthermalfe: -1368.782908 hartree
dipole: 2.0288 -3.9121 0.1227
dipole: 4.4086
quadrupole: -109.8884 -143.7936 -174.6016
quadrupole: 26.3302 0.0245 0.5287
quadrupole: 32.8728 -1.0324 -31.8404 26.3302 0.0245 0.5287
hfenergy: -1369.0572672 hartree
pointgroup: C01 [X(C21H16N2O6)]
dipole: 0.8369408 -1.2237711 -0.9001912 debye
polarizability: 489.174116|18.9897985|255.0048922|-12.219755|115.9238601|188.9316365 unknown
InChI: InChI=1S/C21H16N2O6/c24-17-7-3-1-5-14(17)19(26)22-12-9-10-13(21(28)29)16(11-12)23-20(27)15-6-2-4-8-18(15)25/h1-11,22-25,28H
charge 0 multiplicity 1
45 atoms
O  1.580148 -1.383474 -1.084682
O  -4.198142 1.416301 1.384178
O  2.083813 3.932272 2.74517
O  5.024268 0.469454 0.509023
O  -3.248095 -1.959615 -1.049461
O  3.517476 2.489837 1.648466
N  2.368018 0.392682 0.247508
N  -2.494396 0.146353 0.381539
C  1.130649 0.918656 0.695481
C  -1.340614 0.843482 0.80104
C  1.103451 2.098078 1.534906
C  -0.104001 0.319311 0.345855
C  -1.371941 2.001275 1.629142
C  -0.154721 2.598169 1.973591
C  2.548327 -0.705343 -0.601536
C  3.961923 -1.087356 -0.981639
C  -4.853472 -0.508337 0.071235
C  -3.828636 0.432484 0.667823
C  2.325511 2.801818 1.943619
C  5.162818 -0.520031 -0.467944
C  -4.592092 -1.6471 -0.74414
C  4.09186 -2.114512 -1.95455
C  -6.212001 -0.215385 0.363111
C  6.43387 -0.952221 -0.913249
C  5.34932 -2.554909 -2.408372
C  -5.640975 -2.453165 -1.24153
C  -7.267236 -1.00834 -0.124947
C  6.526754 -1.967519 -1.886666
C  -6.979223 -2.134191 -0.932027
H  -0.076377 -0.565041 -0.294015
H  -2.326591 2.398042 1.974188
H  -0.151582 3.489017 2.60642
H  3.2247 0.872801 0.594887
H  -2.339915 -0.683295 -0.213028
H  3.162233 -2.547738 -2.336693
H  -6.396482 0.662848 0.990546
H  7.341713 -0.498342 -0.495979
H  5.414951 -3.345853 -3.161974
H  -5.412188 -3.325448 -1.867534
H  -8.303427 -0.75499 0.119138
H  7.512336 -2.299128 -2.230987
H  -7.78833 -2.762024 -1.320059
H  2.962372 4.339361 2.970288
H  5.865659 0.918437 0.759448
H  -3.165633 -2.762122 -1.618188
