program: Gaussian 09
title: 000191280
version: EM64L-G09RevD.01
frameworkgroup: C1[X(C5H11NO4)]
method: RPBEPBE
basis: SDD
operation: Freq
keyword: #p
keyword: freq=noraman
keyword: PBEPBE/SDD
title: #p freq=noraman PBEPBE/SDD
converged: YES YES NO NO
title: Mulliken charges:
elementType: O O O O N C C C C C H H H H H H H H H H H
charge: -0.446783 -0.294377 -0.408042 -0.242990 -0.662671 -0.043796 -0.214626 -0.298775 0.175014 -0.490698 0.207210 0.276359 0.219675 0.217485 0.326537 0.289404 0.367837 0.208108 0.203057 0.229191 0.382882
chargesum: 0.00000
title: Mulliken charges with hydrogens summed into heavy atoms:
elementType: O O O O N C C C C C
charge: -0.078946 -0.294377 -0.025160 -0.242990 -0.046731 0.163414 0.061733 0.138385 0.175014 0.149658
polarizability: 9.00922118e+01 2.84169030e+00 7.16253965e+01 4.29172318e-01 -3.14122927e+00 6.24262612e+01
1716.lowfreq: -15.7338 -11.3149 0.0004 0.0006 0.0010 4.2183 38.4885 53.0335 79.6979
frequency: 38.3774 52.9210 79.6367 106.2279 154.2904 200.4813 224.1368 247.3211 274.7996 311.5355 340.0842 396.5040 437.7428 486.5429 541.8954 578.9353 631.4155 674.6592 699.4227 707.2941 823.2421 868.5285 893.4110 1011.2473 1051.3363 1054.1720 1060.0623 1089.0653 1102.5925 1122.4379 1155.1961 1175.6149 1184.7539 1240.2438 1269.5748 1276.7633 1310.2727 1351.7889 1394.5759 1425.4705 1440.1313 1458.6943 1470.2535 1484.6872 1596.3157 1659.2688 2929.0721 2932.2292 2962.3214 2981.4671 3004.5425 3032.1246 3099.9891 3362.9171 3465.8533 3504.0148 3607.1803
redmass: 4.2898 6.6687 3.8859 3.3136 4.3520 1.9594 2.1149 1.9829 1.5775 2.7952 2.9368 4.7510 4.4994 3.0869 4.0577 2.4556 1.4690 1.5273 1.4051 1.8880 4.6531 2.3632 5.4900 2.3408 3.1216 2.9481 2.6657 2.7340 1.7539 1.4518 1.3685 1.4251 1.2034 1.4271 1.2048 1.4722 1.3358 1.2937 1.7010 1.6762 1.2187 1.0522 1.0659 1.0753 1.4010 3.1671 1.0342 1.0828 1.0595 1.0829 1.1024 1.1026 1.0978 1.0630 1.0470 1.0638 1.0977
irintensity: 1.8677 1.1340 1.3338 12.8973 6.3000 1.1438 8.1478 5.4407 7.6034 6.8511 1.2915 13.4089 25.7997 18.3464 13.6948 27.4648 60.5236 158.2790 255.7918 37.0909 24.7368 8.0925 29.0133 14.9968 162.6744 91.4648 36.9905 108.6547 7.9492 5.0154 19.4157 23.0342 3.2382 21.2103 19.9183 17.6621 10.7944 24.9828 15.0685 31.5825 2.5220 12.9591 14.3669 7.9726 202.3274 132.0762 80.4463 57.2970 56.4471 17.0756 79.6015 37.7282 33.4136 55.5431 13.9712 27.8590 21.1420
temp: 298.150 k
press: 1.00000 atm
elementType: 8 8 8 8 7 6 6 6 6 6 1 1 1 1 1 1 1 1 1 1 1
symmnumber: 1
zpe: 442831.4 jmol-1
zpe.correction: 0.168666 hartree
zpe.thermalcorrener: 0.180347 hartree
zpe.thermalcorrenthalpy: 0.181291 hartree
zpe.thermalcorrgfe: 0.130452 hartree
zpe.sumelectzpe: -551.925646 hartree
zpe.sumelectthermal: -551.913965 hartree
zpe.sumelectthermalent: -551.913021 hartree
zpe.sumelectthermalfe: -551.963860 hartree
dipole: 1.1727 1.4988 1.7578
dipole: 2.5907
quadrupole: -58.0295 -56.2236 -59.7518
quadrupole: 4.9121 -6.6266 -6.3380
quadrupole: -0.0279 1.7781 -1.7502 4.9121 -6.6266 -6.3380
hfenergy: -552.0943117 hartree
pointgroup: C01 [X(C5H11N1O4)]
dipole: -0.497411 0.6395036 -0.6184753 debye
dipolederiv: -0.5973015 0.0188438 -0.1053211 0.02882 -0.6677906 0.1330443 -0.1223285 0.1987098 -0.5332404 -0.9351889 0.2277259 -0.0701323 0.2385736 -0.5522916 0.0200295 -0.1133108 0.0749832 -0.4289214 -0.6993626 0.3714063 0.1968225 0.4512037 -0.6923064 -0.1254196 0.2766437 -0.1242992 -0.4209556 -1.0497323 -0.0035363 0.0511512 -0.1820201 -0.5352837 -0.1200853 -0.1641507 -0.1884617 -0.3777769 -0.5750736 0.0875893 0.1228738 0.1404151 -0.610427 0.1444455 0.1769964 0.1492233 -0.5051703 0.4938581 0.0821293 0.141948 0.0063456 0.4897453 -0.0409763 0.0570388 -0.169023 0.3815059 0.1750799 -0.3606658 -0.1314754 -0.1939053 -0.0777673 -0.077426 -0.2537948 -0.0478801 0.1908487 0.4183052 -0.0092996 0.1228333 -0.0425214 0.379254 -0.0705457 0.3315365 -0.1685243 0.3428212 1.4763013 -0.1555354 -0.0905439 -0.0717475 0.9712328 0.371235 0.096945 0.5392889 0.3873804 0.6718926 -0.1254515 -0.0294213 -0.1724858 0.4349138 0.013776 -0.1477749 0.0678604 0.2442604 -0.0138586 -0.0378256 -0.0549918 -0.0676207 -0.1060405 -0.1036955 -0.0541224 -0.0726551 -0.1340381 0.0528933 0.0968754 -0.0501889 0.0623915 -0.008013 0.0330685 -0.0785851 0.043979 -0.0108637 0.0464796 0.025511 -0.0468644 0.0131124 -0.0484173 -0.1257998 -0.1002485 -0.060372 -0.0548794 -0.0822352 -0.1051421 0.0755409 -0.0598821 -0.0720567 0.1171209 -0.0018655 0.1088196 -0.0306998 0.1694513 -0.0203482 0.0479203 -0.1141554 0.2597849 0.0003346 0.0434199 -0.0001953 0.259218 0.1743789 -0.0109997 -0.0398477 -0.0137957 0.2807546 -0.0685832 -0.0069463 -0.1301779 0.1147283 0.2175735 0.0686665 -0.0184936 0.0505394 0.3960879 -0.0711297 0.0230604 -0.096237 0.3326098 -0.0013109 -0.060167 -0.0520535 0.0192614 -0.1411317 -0.1043145 0.0334139 -0.1616947 0.004484 -0.1225392 -0.0298128 0.0824015 -0.1001231 -0.0452168 0.1002558 0.1936535 0.0590145 -0.0135455 -0.0165624 0.0611009 -0.0814382 0.0730348 0.0742411 0.0463058 -0.1292136 0.0643353 -0.0658604 0.1969516 -0.1210643 -0.0707195 -0.0654405 0.2707283 -0.0716402 -0.060367 -0.086694 0.318095 unknown
polarizability: 90.035196|-2.6326658|71.0990446|-1.3107596|3.9480076|63.0096288 unknown
InChI: InChI=1S/C5H11NO4/c1-10-2-3(7)4(6)5(8)9/h3-4,7-8H,2,6H2,1H3
charge 0 multiplicity 1
21 atoms
O  0.641988 -1.766629 1.057783
O  -2.255339 -0.161218 -0.531814
O  0.220044 1.847363 0.423797
O  2.447455 1.258578 0.21457
N  1.916939 -0.953399 -1.258837
C  -0.162674 -1.187943 -0.007433
C  0.731317 -0.185284 -0.82155
C  -1.444396 -0.625197 0.60121
C  1.242131 1.006265 -0.015147
C  -3.433813 0.582207 -0.098208
H  -0.456155 -1.964945 -0.749668
H  0.106631 0.22153 -1.644048
H  -1.227399 0.205106 1.300317
H  -1.969122 -1.434778 1.151218
H  2.79959 -0.438984 -1.167924
H  1.806798 -1.444256 -2.14853
H  1.519626 -1.956769 0.60968
H  -3.147575 1.49196 0.470515
H  -4.100857 -0.042288 0.534034
H  -3.970891 0.875941 -1.014145
H  0.625002 2.606338 0.926483
