program: Gaussian 09
title: 000191308
version: EM64L-G09RevD.01
frameworkgroup: C1[X(C19H14N2O2S3)]
method: RPBEPBE
basis: SDD
operation: Freq
keyword: #p
keyword: freq=noraman
keyword: PBEPBE/SDD
title: #p freq=noraman PBEPBE/SDD
converged: YES YES NO NO
title: Mulliken charges:
elementType: S S S O O N N C C C C C C C C C C C C C C C C C C C H H H H H H H H H H H H H H
charge: 0.225298 0.373883 0.213637 -0.214258 -0.210024 -0.774183 0.023261 0.579181 0.553323 -0.349357 -0.314645 -0.256541 -0.343740 -0.270031 -0.199416 -0.267428 -0.260126 -0.217222 -0.183154 -0.244663 -0.217836 -0.084280 -0.344315 -0.378313 0.382050 -0.867283 0.261203 0.255114 0.252048 0.251041 0.249910 0.233057 0.236366 0.247012 0.277774 0.289632 0.291859 0.264588 0.269350 0.267228
chargesum: 0.00000
title: Mulliken charges with hydrogens summed into heavy atoms:
elementType: S S S O O N N C C C C C C C C C C C C C C C C C C C
charge: 0.225298 0.373883 0.213637 -0.214258 -0.210024 -0.774183 0.023261 0.579181 0.553323 -0.349357 -0.314645 0.004661 -0.088626 -0.017984 -0.199416 -0.016387 -0.010215 0.015835 -0.183154 -0.008296 0.029176 0.193494 -0.054683 -0.086454 0.382050 -0.066117
polarizability: 3.16534924e+02 -9.85801511e+00 3.18647354e+02 1.97838905e+00 1.49846863e+01 2.65996003e+02
1716.lowfreq: -7.2714 -2.6623 -0.0010 -0.0009 0.0013 2.8787 11.7571 25.1575 32.4411
frequency: 11.7459 25.1337 32.4199 36.2445 41.2341 71.9279 80.1665 88.2723 103.8277 111.1927 134.5132 165.2573 193.3749 208.7988 224.2918 238.8208 266.7167 267.6879 278.5930 297.3811 310.1308 325.3557 357.1696 375.9151 410.0090 414.7383 420.7237 436.3985 456.5251 472.0774 472.6688 490.8723 511.7669 532.1570 555.3456 581.1725 606.7554 619.2797 657.8039 664.1039 672.2042 681.8369 683.5556 711.1741 719.1367 724.9364 737.4156 760.2879 786.8962 812.9505 835.8947 853.0225 858.1953 861.3030 892.1907 921.0456 941.0628 945.0145 967.2215 980.5502 980.8075 993.2440 995.6049 998.9329 1021.0561 1037.3251 1047.2899 1052.8773 1092.4474 1094.2808 1113.2602 1126.6768 1149.0811 1172.1030 1179.1201 1204.6993 1222.7183 1238.2505 1268.0698 1286.8792 1290.3442 1347.9046 1355.7416 1365.3340 1376.0868 1394.9102 1397.0051 1410.5773 1427.1905 1449.7519 1454.4428 1458.5768 1460.0145 1466.9148 1562.8849 1576.1876 1583.0503 1587.6221 1589.4631 1598.8821 3006.6574 3123.4427 3134.4404 3136.9427 3137.1448 3138.1937 3141.3576 3145.9649 3158.8685 3161.5569 3167.7837 3173.1289 3182.2579 3185.5570
redmass: 9.9264 3.6004 6.0348 7.2337 6.6152 6.9326 6.7819 5.9513 6.2191 4.8785 5.5305 5.3832 4.2789 2.6132 4.0754 2.3022 4.8695 7.2761 8.2214 7.2421 8.5304 7.1835 7.8901 8.8914 2.9692 5.3681 7.2250 3.1334 5.6906 5.3040 3.7140 9.8239 7.0254 4.2061 7.6061 5.5082 7.1423 7.1666 6.4933 5.1742 7.1008 7.1712 8.2716 3.8812 4.2641 4.4182 4.6169 1.3933 9.4922 1.3599 1.3590 1.6169 1.4087 1.4042 5.8299 5.7480 1.3990 1.3489 1.1796 1.3246 1.3437 1.3223 3.6922 1.3412 6.4945 3.4356 3.0359 3.7613 2.1019 3.0419 1.2902 1.6277 1.4674 1.0600 1.3801 3.1549 5.0216 1.8405 1.3480 1.9712 1.2649 1.1828 6.5916 8.5642 9.2873 3.6844 9.3323 4.4127 2.2682 2.1729 1.0522 2.1030 1.9273 1.3409 7.9824 6.4374 6.8643 6.7355 7.7100 6.6259 1.0292 1.1062 1.1020 1.0863 1.0907 1.0905 1.0877 1.0900 1.0942 1.0969 1.0902 1.1008 1.0940 1.0951
irintensity: 0.3314 2.2971 0.0964 0.3586 0.2076 0.8408 1.0213 1.6703 1.8368 0.9904 0.8980 0.7010 2.2777 1.2120 1.3495 0.0991 1.2438 0.9354 1.1838 0.4219 2.1808 0.8431 3.7028 0.7216 0.3964 3.2424 3.9978 0.6086 27.1894 9.8046 12.4538 7.7485 6.1902 1.4787 4.9011 6.5920 0.6542 2.6536 2.8736 15.5893 2.5982 5.1216 1.0566 0.9541 4.6202 9.3187 33.2205 66.0252 34.3941 41.8649 18.6279 17.3116 0.7987 27.6926 8.1023 67.1758 6.4996 0.7293 9.0225 0.3891 2.7733 3.9311 15.0355 1.4728 14.7308 11.5917 8.1931 40.1630 44.1423 13.1372 10.5197 13.4489 15.8839 1.6183 83.7859 85.9370 407.3628 31.7141 6.4753 48.0343 0.8748 1.3146 56.9990 46.3040 4.6806 30.8888 49.4918 35.0228 15.4976 285.7287 14.6595 44.9661 16.8640 9.9874 18.3685 52.3437 118.4484 84.2316 29.1595 6.9042 19.1133 16.2399 8.9912 2.0887 17.0215 3.7329 2.3645 7.7833 12.5069 8.3272 1.0756 20.5080 1.3993 1.5478
temp: 298.150 k
press: 1.00000 atm
elementType: 16 16 16 8 8 7 7 6 6 6 6 6 6 6 6 6 6 6 6 6 6 6 6 6 6 6 1 1 1 1 1 1 1 1 1 1 1 1 1 1
symmnumber: 1
zpe: 743571.0 jmol-1
zpe.correction: 0.283211 hartree
zpe.thermalcorrener: 0.306585 hartree
zpe.thermalcorrenthalpy: 0.307530 hartree
zpe.thermalcorrgfe: 0.227146 hartree
zpe.sumelectzpe: -2184.644122 hartree
zpe.sumelectthermal: -2184.620748 hartree
zpe.sumelectthermalent: -2184.619804 hartree
zpe.sumelectthermalfe: -2184.700188 hartree
dipole: 4.7178 1.1320 -4.1908
dipole: 6.4111
quadrupole: -216.4536 -159.0555 -159.8280
quadrupole: -8.7638 12.3177 8.3764
quadrupole: -38.0079 19.3902 18.6177 -8.7638 12.3177 8.3764
hfenergy: -2184.9273337 hartree
pointgroup: C01 [X(C19H14N2O2S3)]
dipole: -1.9254996 -0.2175823 -1.6146705 debye
polarizability: 310.9463226|-8.9713567|315.8804329|-5.1525408|-24.3387324|274.3515265 unknown
InChI: InChI=1S/C19H14N2O2S3/c1-24-15-10-11-19-17(12-15)20(16-4-2-3-5-18(16)25-19)26-14-8-6-13(7-9-14)21(22)23/h2-12H,1H3
charge 0 multiplicity 1
40 atoms
S  -1.6015 -0.79737 2.427921
S  0.153697 -0.067835 -1.851444
S  -2.839959 4.686754 -0.808389
O  6.639689 0.109174 0.193027
O  5.64725 -0.255729 2.215891
N  -1.007314 -0.338344 -0.524937
N  5.597986 -0.073779 0.937306
C  -1.631724 0.796084 0.101533
C  -1.443671 -1.681198 -0.24446
C  -2.030266 0.702507 1.458442
C  -1.817262 -2.029482 1.081004
C  -1.885377 1.989933 -0.617137
C  -1.528567 -2.666129 -1.258832
C  -2.685725 1.786102 2.080565
C  -2.499985 3.089219 0.020807
C  -2.279919 -3.326557 1.383449
C  -2.909726 2.984253 1.375677
C  -1.95411 -3.975251 -0.948338
C  1.767331 -0.077662 -0.944344
C  -2.336742 -4.309851 0.370559
C  2.93157 0.116818 -1.730072
C  1.852023 -0.270383 0.452531
C  4.195167 0.118937 -1.113317
C  3.115198 -0.269212 1.073838
C  4.270891 -0.074777 0.285033
C  -2.097881 4.431242 -2.511597
H  -1.584389 2.037713 -1.66669
H  -1.2451 -2.405212 -2.28296
H  -3.003216 1.698883 3.124716
H  -2.577506 -3.566154 2.40968
H  -3.396576 3.828742 1.874035
H  -1.998021 -4.728672 -1.741829
H  -2.67708 -5.322058 0.610714
H  2.858303 0.26407 -2.813485
H  0.945714 -0.419981 1.049318
H  5.113247 0.265465 -1.687914
H  3.217444 -0.415341 2.15234
H  -2.619707 3.624817 -3.050399
H  -1.019032 4.222802 -2.438821
H  -2.252759 5.384067 -3.040721
