program: Gaussian 09
title: 000017726
version: EM64L-G09RevD.01
frameworkgroup: C1[X(C4H7NO2)]
method: RPBEPBE
basis: SDD
operation: Freq
keyword: #pfreq=noraman
keyword: PBEPBE/SDD
title: #p freq=noraman PBEPBE/SDD
converged: YES YES NO NO
title: Mulliken charges:
elementType: O O N C C C C H H H H H H H
charge: -0.213566 -0.205028 0.042175 -0.429575 0.433455 -0.687325 -0.623513 0.251419 0.251595 0.219336 0.231669 0.219011 0.267035 0.243312
chargesum: 0.00000
title: Mulliken charges with hydrogens summed into heavy atoms:
elementType: O O N C C C C
charge: -0.213566 -0.205028 0.042175 0.073440 0.433455 -0.017310 -0.113166
polarizability: 6.67665402e+01 -7.48588529e-01 7.47330921e+01 -3.44020645e-02 -1.20258204e-02 3.40467757e+01
1716.lowfreq: -9.0862 -0.0006 -0.0004 0.0006 2.3618 12.2288 58.4308 90.8110 226.0933
frequency: 58.4191 90.8058 226.0925 265.0312 333.4768 378.9670 401.0606 500.9221 590.6806 611.7989 781.3968 781.9784 790.8067 868.0732 968.5957 1021.3377 1066.8195 1094.2265 1158.8618 1204.7369 1249.4371 1336.8498 1382.0297 1388.2922 1403.0358 1453.3306 1485.3291 1489.2976 1665.3974 2987.1228 2996.7163 3037.6408 3083.6220 3090.7067 3128.5905 3242.0674
redmass: 6.1322 2.1162 3.9803 1.0956 3.2823 3.0775 3.9837 5.2124 1.6900 3.9961 6.7928 1.8646 1.2084 2.0642 1.3356 1.8224 2.0840 1.5497 2.2036 12.4921 1.1420 1.6402 4.6021 1.4498 1.1974 1.0858 1.0407 1.0552 5.8735 1.0363 1.0609 1.0987 1.1007 1.0991 1.0615 1.1156
irintensity: 0.5910 1.4823 2.2714 0.0061 1.1784 1.0524 4.5150 0.8081 11.1245 2.8077 21.2852 3.3243 3.2294 12.7212 69.4006 10.1897 0.8564 0.5054 17.0736 117.6908 0.0032 12.9425 142.3033 6.4113 25.1002 23.4614 13.7867 9.2427 15.0144 20.2049 6.1034 1.6465 40.1376 27.0944 3.1818 0.4031
temp: 298.150 k
press: 1.00000 atm
elementType: 8 8 7 6 6 6 6 1 1 1 1 1 1 1
symmnumber: 1
zpe: 284792.3 jmol-1
zpe.correction: 0.108472 hartree
zpe.thermalcorrener: 0.115962 hartree
zpe.thermalcorrenthalpy: 0.116906 hartree
zpe.thermalcorrgfe: 0.076392 hartree
zpe.sumelectzpe: -361.165905 hartree
zpe.sumelectthermal: -361.158415 hartree
zpe.sumelectthermalent: -361.157470 hartree
zpe.sumelectthermalfe: -361.197985 hartree
dipole: -4.3211 1.4439 0.0070
dipole: 4.5560
quadrupole: -46.9216 -41.4687 -41.3740
quadrupole: 1.3128 0.0018 0.0057
quadrupole: -3.6668 1.7860 1.8807 1.3128 0.0018 0.0057
hfenergy: -361.2743766 hartree
pointgroup: C01 [X(C4H7N1O2)]
dipole: -1.6946825 -0.5808541 -0.0600199 debye
dipolederiv: -0.8157001 0.1646052 0.0331605 0.1382685 -0.5241452 -0.045158 0.0288862 -0.0457482 -0.2375 -0.4888721 -0.1211551 -0.0138753 0.0891354 -0.7856067 -0.0829861 0.0171396 -0.079777 -0.2416744 1.1510746 0.2155942 0.0176301 -0.0360357 1.1335839 0.1380043 -0.0194275 0.1345711 0.2154666 0.0079912 0.0024192 0.002378 0.0749625 -0.1116575 -0.0385918 0.0119772 -0.0358397 0.1376162 0.0616445 -0.3241907 -0.048332 -0.4794459 0.0514407 0.0137918 -0.070525 0.0101944 0.010059 -0.0501017 -0.0321651 -0.0017569 0.0216872 0.0650364 -0.0045118 0.0064207 -0.0039819 0.0959172 -0.0647702 0.0059186 -0.0025577 0.2297166 -0.1104663 0.0234648 0.0301157 0.0270863 -0.2891392 0.0342302 -0.0043136 0.0403782 -0.0130414 0.0106298 0.0859876 0.0277234 0.0942265 0.0117424 0.0321988 0.0031861 -0.042379 -0.0076929 0.0599577 -0.0720291 -0.0319934 -0.0805756 -0.0329165 0.0760298 -0.0042775 -0.0003708 -0.0695491 -0.025861 0.1291743 0.0206918 0.1088384 -0.0372496 -0.0559313 0.1024869 0.0179609 0.1475416 -0.0298129 -0.0229625 0.0245488 -0.0220639 0.1057625 0.0746028 -0.0075805 -0.0070924 -0.0651978 0.0369289 -0.1049773 -0.0460062 -0.0871382 -0.0988524 0.0517968 0.0664788 0.0121951 0.0434627 0.1094021 -0.0151262 0.0090729 -0.0153826 0.2048615 -0.0141933 -0.0670065 -0.0073387 -0.0738117 0.1205701 -0.0040799 -0.0086241 -0.0044097 0.1559066 unknown
polarizability: 66.7458841|0.7428782|73.88836|-0.402254|5.844783|34.9121639 unknown
InChI: InChI=1S/C4H7NO2/c1-3-4(2)5(6)7/h2-3H2,1H3
charge 0 multiplicity 1
14 atoms
O  2.198631 -0.575569 -0.118106
O  1.320362 1.503162 0.200316
N  1.201199 0.229677 0.015145
C  -1.284391 0.724422 0.125432
C  -0.201721 -0.316974 -0.043964
C  -2.712796 0.149198 0.072205
C  -0.334141 -1.650866 -0.238733
H  -1.154165 1.499477 -0.654149
H  -1.119073 1.253605 1.083207
H  -2.884044 -0.59131 0.874676
H  -3.447524 0.962307 0.204054
H  -2.920914 -0.336572 -0.898531
H  0.547296 -2.289767 -0.346369
H  -1.325819 -2.106591 -0.291083
