program: Gaussian 09
title: 000191321
version: EM64L-G09RevD.01
frameworkgroup: C1[X(C25H29NO5)]
method: RPBEPBE
basis: SDD
operation: Freq
keyword: #p
keyword: freq=noraman
keyword: PBEPBE/SDD
title: #p freq=noraman PBEPBE/SDD
converged: YES YES NO NO
title: Mulliken charges:
elementType: O O O O O N C C C C C C C C C C C C C C C C C C C C C C C C C H H H H H H H H H H H H H H H H H H H H H H H H H H H H H
charge: -0.277981 -0.306688 -0.256172 -0.430268 -0.315770 -0.130755 -0.072697 -0.177354 -0.481731 -0.438693 -0.051706 -0.508728 -0.446094 -0.411712 -0.395338 0.497070 0.010712 -0.516489 0.288727 -0.482475 0.108494 0.220859 -0.501391 -0.586822 0.313525 0.479160 -0.360414 -0.393805 -0.394418 -0.369533 -0.522900 0.202769 0.262846 0.209898 0.214486 0.239986 0.193839 0.260174 0.234957 0.261777 0.205653 0.235766 0.210100 0.184239 0.193672 0.226036 0.284351 0.271156 0.239051 0.232437 0.236889 0.222719 0.378629 0.270742 0.249385 0.253871 0.233719 0.228256 0.229495 0.244486
chargesum: 0.00000
title: Mulliken charges with hydrogens summed into heavy atoms:
elementType: O O O O O N C C C C C C C C C C C C C C C C C C C C C C C C C
charge: -0.277981 -0.306688 -0.256172 -0.051639 -0.315770 -0.130755 0.130072 0.085492 -0.057347 -0.004868 0.208468 -0.011993 -0.004675 -0.017373 0.024371 0.497070 0.010712 -0.232138 0.288727 -0.211319 0.108494 0.220859 -0.029903 -0.127213 0.313525 0.479160 -0.089672 -0.144419 -0.140547 -0.135814 0.179338
polarizability: 3.69952825e+02 4.64916881e+00 2.51285368e+02 -1.02074079e+01 -3.88505544e+00 2.42171931e+02
1716.lowfreq: -13.4804 0.0000 0.0004 0.0005 3.7641 10.6797 33.4273 36.8191 46.3198
frequency: 32.0717 36.7839 46.2304 58.6407 63.5727 79.2975 94.4027 107.6012 121.3582 130.6643 142.7816 154.6609 170.7676 178.5184 188.9871 196.9817 207.2743 242.2787 251.6042 265.4847 270.7502 275.6102 293.6186 308.2442 335.4347 352.8715 371.2057 394.6323 399.7014 405.1267 410.1997 421.4220 429.0925 431.6113 441.8253 461.5215 475.2327 489.2972 496.9376 516.9701 534.8497 545.7396 560.9730 571.7156 592.0794 618.1280 628.2108 652.1457 676.6744 682.5454 699.3729 712.3120 722.0160 729.0825 742.5314 759.3498 786.7529 793.6296 815.7912 818.1580 823.5241 831.2869 837.9858 840.9467 848.0202 872.0592 881.1704 892.8897 905.6767 920.1210 932.3774 934.4950 948.8219 962.7602 969.4056 979.7997 986.6433 993.9720 999.1626 1004.9137 1025.7315 1048.4491 1070.5586 1075.1497 1083.5196 1097.9895 1113.6622 1116.4109 1117.5578 1123.7134 1144.3183 1148.8964 1152.3176 1162.7472 1165.4704 1166.0549 1167.9780 1183.3223 1195.6745 1199.7521 1204.2993 1221.9160 1224.7583 1246.3217 1252.0389 1257.7563 1268.0053 1286.8283 1291.7245 1296.2419 1305.4383 1311.0049 1322.8774 1325.8478 1330.2099 1335.1370 1336.4849 1345.7200 1347.2492 1351.5031 1356.3730 1362.9668 1370.3020 1380.6910 1407.5893 1413.9393 1434.3509 1436.8868 1438.9874 1446.4178 1451.0372 1457.7562 1463.7080 1465.1748 1467.2084 1470.7370 1474.5181 1477.4455 1490.1045 1500.8774 1586.4748 1589.9448 1615.1172 1628.1268 1633.8650 2947.2888 2956.6884 2968.2537 2971.2472 2973.7130 2978.5473 2984.1447 2994.4133 3000.8712 3004.3492 3015.7850 3021.8657 3031.2644 3035.1248 3051.0015 3055.1710 3059.0451 3061.5822 3063.7661 3082.5551 3094.2288 3121.2203 3129.7266 3132.3768 3157.2347 3161.8297 3162.9540 3174.3979 3520.3057
redmass: 4.0054 5.5207 4.6702 4.3699 7.9674 4.1883 3.9933 4.4048 5.8402 3.6663 5.3370 4.5438 3.3151 3.9723 2.7290 2.7299 3.6301 3.1976 2.6983 3.6845 4.1410 3.0512 2.9503 3.7468 2.1758 2.5557 3.0913 3.1534 3.7544 2.8512 3.2205 3.9434 3.4357 3.2607 3.4624 3.4790 1.1496 2.5832 4.4177 3.9273 4.6144 3.2713 3.8045 2.3855 4.4240 4.8177 6.1101 7.3040 4.2798 5.1246 5.0535 3.2483 3.5795 4.0016 3.3217 4.0138 2.4580 3.3368 2.1256 2.1162 1.3123 2.1593 2.2666 2.0747 2.7146 1.9197 2.1265 1.9999 2.5062 2.3677 1.8611 2.5487 1.4681 1.3962 2.7955 2.2010 3.6324 2.5955 2.0186 2.7578 2.5845 2.0229 4.4247 2.1926 1.9338 1.5808 2.8092 1.6308 1.2562 1.7837 1.8083 1.8746 1.6032 1.5387 1.8063 1.5077 1.3932 1.5178 1.5529 1.8347 1.6654 1.9929 1.6171 1.3763 1.5365 1.4350 1.4408 1.5807 3.6524 1.3353 1.2885 1.3372 1.5304 1.3002 1.3226 1.4746 1.4517 1.3818 1.4108 1.5273 1.5664 1.3595 1.4703 5.3595 2.4057 3.1621 1.9124 1.3344 1.3543 1.1061 1.1025 1.0868 1.0883 1.0495 1.0847 1.1164 1.1138 1.0929 2.5587 3.1978 7.5805 7.5425 6.4655 9.7981 7.2302 1.0828 1.0631 1.0323 1.0692 1.0711 1.0657 1.0649 1.0630 1.0599 1.0655 1.0611 1.0962 1.0848 1.1013 1.0998 1.1002 1.1045 1.0976 1.1032 1.0974 1.1019 1.0893 1.1005 1.0885 1.0957 1.0911 1.0957 1.0915 1.0647
irintensity: 0.9906 1.3526 0.2176 1.4393 2.7696 0.0513 3.2819 0.2531 1.8241 0.1651 0.1954 0.1773 2.6164 3.0864 0.7196 1.6529 6.5653 0.6768 0.2041 3.3876 0.9632 1.3563 2.0978 7.2947 2.8745 2.4365 0.6534 1.3510 3.5867 0.5252 0.7739 4.1234 3.0070 3.6413 4.7576 20.7244 120.5750 1.8424 0.4343 4.9024 17.5145 22.8723 3.1775 13.8331 9.2406 0.7429 0.6875 3.7986 1.1689 1.3935 1.1168 2.7534 4.4760 5.2881 2.9003 2.2452 14.7283 15.0950 16.9103 40.9856 12.3565 25.2471 36.4450 11.1251 35.7955 2.9390 35.1621 32.6289 10.0103 22.1519 8.8314 4.1087 0.8098 0.9842 30.9879 15.5051 18.6773 36.6930 6.6578 1.9344 63.6867 22.7945 72.3416 31.5014 15.4668 71.1192 18.0844 65.1763 0.0324 22.6428 17.3015 19.0243 56.4637 32.6886 97.9497 101.1519 29.2813 38.2415 28.7497 232.9210 62.7340 4.3034 6.6597 22.6072 70.6008 21.7322 1.8407 1.6083 83.0593 2.6810 4.6376 3.7125 11.0649 14.3385 13.1494 26.7560 17.4155 7.4462 8.0615 3.3743 35.1820 3.8372 0.0595 1.0058 31.1256 2.1402 9.5280 6.0260 59.6004 19.0889 11.1817 10.5404 5.1887 14.6170 16.7542 15.2053 102.4041 9.1166 245.5403 103.0922 14.9851 3.7871 44.1228 165.7838 19.3273 28.9785 49.4219 62.3428 59.3616 1.9088 27.3397 28.6849 37.1906 37.5793 14.0962 38.4244 55.9439 28.3355 57.3736 57.7118 32.1707 40.2229 41.4376 9.4588 13.5516 17.3559 15.6958 24.2812 9.5424 5.5556 1.1333 3.4230 2.2201 94.9037
temp: 298.150 k
press: 1.00000 atm
elementType: 8 8 8 8 8 7 6 6 6 6 6 6 6 6 6 6 6 6 6 6 6 6 6 6 6 6 6 6 6 6 6 1 1 1 1 1 1 1 1 1 1 1 1 1 1 1 1 1 1 1 1 1 1 1 1 1 1 1 1 1
symmnumber: 1
zpe: 1297419.2 jmol-1
zpe.correction: 0.494161 hartree
zpe.thermalcorrener: 0.521158 hartree
zpe.thermalcorrenthalpy: 0.522102 hartree
zpe.thermalcorrgfe: 0.438738 hartree
zpe.sumelectzpe: -1398.617617 hartree
zpe.sumelectthermal: -1398.590619 hartree
zpe.sumelectthermalent: -1398.589675 hartree
zpe.sumelectthermalfe: -1398.673040 hartree
dipole: 0.8440 -0.9754 2.7146
dipole: 3.0055
quadrupole: -153.3853 -178.1264 -190.3906
quadrupole: -15.2698 -0.5148 -0.7758
quadrupole: 20.5822 -4.1590 -16.4232 -15.2698 -0.5148 -0.7758
hfenergy: -1399.1117776 hartree
pointgroup: C01 [X(C25H29N1O5)]
dipole: -0.3476626 -0.3906565 -1.0605288 debye
polarizability: 369.6143346|-5.6383401|251.4372709|-11.6313262|3.9500678|242.358519 unknown
InChI: InChI=1S/C25H29NO5/c1-29-24-15-23-20(14-22(24)27)21-13-19(12-17-4-2-3-11-26(17)21)31-25(28)10-7-16-5-8-18(30-23)9-6-16/h5-6,8-9,14-15,17,19,21,27H,2-4,7,10-13H2,1H3
charge 0 multiplicity 1
60 atoms
O  3.015424 0.46661 0.952385
O  -1.14648 -1.189947 -1.565139
O  3.474507 -1.094105 2.632626
O  -4.662745 0.980337 2.266665
O  -5.541891 -0.944026 0.603744
N  -0.0858 2.421953 0.219138
C  1.292852 3.023207 0.211824
C  -0.069222 0.926542 0.378906
C  2.051178 2.66616 1.509502
C  2.082422 2.709905 -1.094904
C  2.036994 1.175512 1.866931
C  0.628759 0.577351 1.722863
C  -0.845327 2.904123 -0.972134
C  1.28408 3.182798 -2.33533
C  -0.151654 2.602027 -2.326764
C  -1.494833 0.361709 0.375574
C  -1.949595 -0.655646 -0.505335
C  -2.43471 0.885124 1.303615
C  3.667474 -0.655457 1.473218
C  -3.28128 -1.133421 -0.475441
C  -3.759053 0.429712 1.349441
C  -4.186485 -0.589139 0.450069
C  4.614472 -1.27528 0.452618
C  4.123755 -2.699041 0.01354
C  0.094373 -1.788836 -1.225485
C  2.70242 -2.607972 -0.515705
C  0.297685 -2.468004 -0.004961
C  1.140891 -1.656358 -2.165433
C  1.60545 -2.866954 0.343214
C  2.439802 -2.062288 -1.799786
C  -6.076821 -1.969848 -0.293824
H  1.128442 4.12264 0.227485
H  0.506579 0.444746 -0.437092
H  3.093731 3.029433 1.448859
H  1.562126 3.194398 2.351247
H  2.295232 1.627058 -1.160471
H  3.064942 3.221067 -1.054908
H  2.404986 1.007374 2.896146
H  0.018219 0.988691 2.549419
H  0.670393 -0.516294 1.85429
H  -0.957779 4.002068 -0.860419
H  -1.858349 2.468093 -0.946482
H  1.814209 2.901757 -3.265799
H  1.222413 4.292064 -2.325546
H  -0.750614 3.034805 -3.152134
H  -0.121459 1.506747 -2.493045
H  -2.134171 1.701989 1.966784
H  -3.566455 -1.912503 -1.186744
H  4.688845 -0.612357 -0.424966
H  5.613089 -1.364169 0.919639
H  4.175904 -3.375377 0.88544
H  4.826349 -3.078414 -0.75194
H  -5.544888 0.540549 2.139706
H  -0.5382 -2.621018 0.684999
H  0.937156 -1.17952 -3.129153
H  1.785487 -3.326045 1.322138
H  3.269443 -1.897676 -2.498576
H  -5.543994 -2.930081 -0.156431
H  -6.001271 -1.647973 -1.349896
H  -7.133502 -2.0852 -0.012185
