program: Gaussian 09
title: 000191291
version: EM64L-G09RevD.01
frameworkgroup: C1[X(C16H31N5S)]
method: RPBEPBE
basis: SDD
operation: Freq
keyword: #p
keyword: freq=noraman
keyword: PBEPBE/SDD
title: #p freq=noraman PBEPBE/SDD
converged: YES YES NO NO
title: Mulliken charges:
elementType: S N N N N N C C C C C C C C C C C C C C C C H H H H H H H H H H H H H H H H H H H H H H H H H H H H H H H
charge: -0.100661 -0.092016 -0.092112 -0.101768 -0.101425 -0.107787 -0.337294 -0.337192 -0.348007 -0.364116 -0.347989 -0.364208 -0.398357 -0.386148 -0.398312 -0.386098 -0.398705 -0.398708 -0.327233 -0.327461 -0.193785 -0.620193 0.207559 0.255891 0.255871 0.207623 0.190541 0.241232 0.206086 0.178614 0.241217 0.190425 0.178629 0.206085 0.195471 0.200060 0.198108 0.191994 0.200113 0.195492 0.192015 0.198069 0.212494 0.191805 0.191801 0.212523 0.270902 0.194676 0.194788 0.270784 0.192673 0.233013 0.233022
chargesum: 0.00000
title: Mulliken charges with hydrogens summed into heavy atoms:
elementType: S N N N N N C C C C C C C C C C C C C C C C
charge: -0.100661 -0.092016 -0.092112 -0.101768 -0.101425 -0.107787 0.126156 0.126301 0.083766 0.020583 0.083653 0.020507 -0.002825 0.003954 -0.002707 0.003986 0.005594 0.005615 0.138345 0.138111 -0.193785 0.038514
polarizability: 2.70254752e+02 9.86218784e-03 1.98209993e+02 -1.40053518e-02 -1.22780307e+01 2.01676393e+02
1716.lowfreq: -14.5107 -0.0010 -0.0004 0.0014 2.7136 8.3919 11.6492 21.4348 34.7684
frequency: 9.5982 21.3353 34.7575 51.1060 54.0994 56.9663 69.0556 101.9419 119.9353 164.1868 165.9386 205.4994 213.8507 221.4391 244.1683 253.9813 254.4953 270.8105 279.9096 286.7077 328.6583 340.9180 363.7643 372.0776 384.6291 386.4547 397.4862 432.3853 443.1467 448.6705 454.6185 511.8455 535.4710 555.3779 579.7813 589.9697 615.8547 689.2266 759.6131 759.8774 805.8786 805.9566 848.5066 849.0840 852.6339 854.0620 879.8210 901.7035 908.6594 913.6371 956.7894 956.9573 982.7214 987.4703 992.5298 1017.9122 1025.7304 1029.7425 1041.1978 1046.6524 1048.8864 1069.6546 1088.4887 1090.0187 1093.8985 1104.7910 1116.3833 1122.9926 1125.0796 1136.3108 1147.0772 1151.5290 1151.9795 1154.3319 1154.6599 1204.8361 1206.1325 1222.7546 1240.0805 1255.2474 1258.1462 1259.7843 1265.9609 1266.0296 1278.7596 1285.9442 1289.2178 1296.7088 1296.9133 1320.9884 1330.4815 1331.0350 1338.7668 1338.8502 1343.4697 1346.3175 1347.0263 1350.1203 1354.6934 1369.5796 1371.4923 1392.1126 1394.7346 1416.1735 1436.7478 1453.1432 1453.5943 1458.8631 1460.5660 1460.5796 1463.3834 1465.8224 1466.5525 1467.3418 1468.1874 1473.3550 1473.6625 1480.7006 1482.9982 1484.2886 1488.6826 1496.3074 2784.2630 2797.1379 2843.8788 2844.1491 2870.0833 2871.3380 2871.9802 2935.6077 2936.3086 2967.4255 2967.4932 2981.3955 2981.4481 2984.5373 2984.7799 2995.2461 2995.6187 3010.6128 3010.7686 3029.3432 3031.0387 3032.0957 3032.1820 3032.8085 3043.5912 3043.6853 3050.3586 3050.6207 3054.5663 3054.8150 3090.2158
redmass: 3.3513 4.5984 4.7790 2.8445 3.1632 4.2159 5.9509 2.6751 3.1828 3.3963 2.1436 2.9965 1.4454 2.1662 4.9539 2.4682 2.1130 2.4059 2.5162 2.9881 2.5027 1.9935 2.1819 2.8243 1.8441 1.9331 3.9858 3.0747 2.9238 2.9535 2.9689 2.0714 4.6698 1.8693 6.8603 2.6658 6.0352 4.9364 3.5920 3.6865 1.4776 1.4772 2.5937 2.3094 1.4906 1.5734 3.6186 2.8001 2.7034 2.5134 1.3018 1.3020 2.8639 2.5357 2.5378 2.0762 2.2165 1.7664 1.6962 2.1243 2.0502 2.1316 1.3556 1.4374 2.3417 2.5250 1.3611 2.8177 2.6152 2.6490 1.6915 2.0458 1.2848 2.4057 1.7291 1.3013 1.5557 1.5542 2.6701 1.5199 1.2845 3.4297 1.2136 1.2176 1.6710 1.5866 1.3427 1.4891 1.4297 1.5043 1.2923 1.2937 1.4305 1.4265 1.7482 1.4045 1.4307 1.4181 1.6197 1.3635 1.3458 1.3378 1.3922 1.4217 1.2665 1.0951 1.0923 1.1270 1.0872 1.0895 1.0883 1.0539 1.1025 1.0904 1.1292 1.0791 1.0870 1.3575 1.1002 1.3043 1.2570 1.1254 1.0702 1.0693 1.0703 1.0703 1.0572 1.0704 1.0698 1.0577 1.0580 1.0620 1.0620 1.0627 1.0627 1.0613 1.0613 1.1036 1.1034 1.0872 1.0873 1.0865 1.0735 1.0963 1.0954 1.0912 1.1024 1.1024 1.0949 1.0964 1.0986 1.0969 1.1014
irintensity: 0.6670 0.1261 3.1610 0.3107 2.6773 0.7138 0.7722 0.5345 2.7680 0.2138 5.2757 0.4528 3.3860 0.6979 2.6407 0.0038 0.5117 0.0374 1.3607 7.0946 0.2747 12.6812 9.9622 0.0315 2.8191 0.1993 9.1986 1.9702 0.4501 1.0503 0.4572 0.4838 29.1372 0.8482 4.3891 1.9185 1.8627 7.8089 0.3750 6.4490 0.0689 0.0735 2.7066 3.2003 9.5496 10.4834 17.1089 3.2641 10.6670 13.6941 3.1905 2.6347 28.3832 95.1349 6.0931 0.0259 22.3884 4.8012 16.0361 4.8597 5.7526 15.8264 8.5118 31.2860 170.0591 31.6030 20.6880 8.1235 5.0382 59.6837 10.3693 72.3045 3.5239 23.1347 43.2048 36.6594 65.0950 31.5669 40.3423 9.9736 2.3424 6.2728 3.5467 4.6659 107.3800 206.9337 11.4351 25.4074 38.0013 43.3699 3.5729 6.2239 4.1294 1.0234 78.7612 9.1105 5.1704 2.3780 42.4423 19.8631 1.3872 3.8448 14.0467 33.7514 5.2902 4.4459 5.7542 0.9652 22.7023 1.0417 1.4895 21.6457 28.8521 12.3132 16.5736 20.6811 10.0864 65.0862 14.3463 79.0950 93.7091 23.7017 38.0127 203.0178 106.3011 96.9433 231.9540 0.7992 70.4620 73.3193 61.7778 27.3287 51.7727 44.2093 15.6719 14.9309 44.8950 3.9819 14.1925 33.1188 110.9067 0.0617 26.1358 75.9743 49.5412 35.4909 40.9766 23.5902 50.6665 1.2186 122.1790 40.0684 21.7071
temp: 298.150 k
press: 1.00000 atm
elementType: 16 7 7 7 7 7 6 6 6 6 6 6 6 6 6 6 6 6 6 6 6 6 1 1 1 1 1 1 1 1 1 1 1 1 1 1 1 1 1 1 1 1 1 1 1 1 1 1 1 1 1 1 1
symmnumber: 1
zpe: 1226350.9 jmol-1
zpe.correction: 0.467092 hartree
zpe.thermalcorrener: 0.489595 hartree
zpe.thermalcorrenthalpy: 0.490539 hartree
zpe.thermalcorrgfe: 0.412957 hartree
zpe.sumelectzpe: -1298.321123 hartree
zpe.sumelectthermal: -1298.298621 hartree
zpe.sumelectthermalent: -1298.297677 hartree
zpe.sumelectthermalfe: -1298.375258 hartree
dipole: 0.0127 2.6136 -3.6228
dipole: 4.4672
quadrupole: -126.1299 -135.1171 -152.1603
quadrupole: -0.0040 0.0114 -0.5721
quadrupole: 11.6725 2.6854 -14.3579 -0.0040 0.0114 -0.5721
hfenergy: -1298.7882158 hartree
pointgroup: C01 [X(C16H31N5S1)]
dipole: 0.0098914 -0.9095066 1.5038482 debye
polarizability: 270.2543892|0.0910199|196.2516759|-0.1140078|-11.8376463|203.6350719 unknown
InChI: InChI=1S/C16H31N5S/c1-17-12-20(14-18-8-4-2-5-9-18)16(22)21(13-17)15-19-10-6-3-7-11-19/h2-15H2,1H3
charge 0 multiplicity 1
53 atoms
S  -0.009975 0.199509 -2.782214
N  -3.306671 -0.01753 -0.29008
N  3.30459 -0.003854 -0.308619
N  -1.177218 -1.133701 -0.680327
N  1.177597 -1.128111 -0.688273
N  0.008271 -1.548801 1.375456
C  -2.515253 -0.839003 -1.230524
C  2.510773 -0.825723 -1.246425
C  -2.823848 1.387924 -0.205594
C  -4.766282 -0.095849 -0.547829
C  2.81901 1.400359 -0.220026
C  4.76343 -0.078883 -0.571509
C  -3.553573 2.141277 0.923431
C  -5.554856 0.620982 0.568113
C  3.551222 2.153688 0.907394
C  5.554267 0.637912 0.542859
C  -5.085092 2.087225 0.716263
C  5.082097 2.1030 0.694677
C  -1.190293 -1.877182 0.596928
C  1.201981 -1.873232 0.587634
C  -0.00281 -0.736329 -1.307255
C  0.014365 -2.146441 2.721447
H  -3.061485 -1.793273 -1.380674
H  -2.346951 -0.35963 -2.217975
H  2.333594 -0.344094 -2.231212
H  3.06006 -1.777112 -1.403304
H  -2.984814 1.921233 -1.176203
H  -1.735141 1.36687 -0.023199
H  -5.057965 -1.163097 -0.596521
H  -5.032517 0.367462 -1.533642
H  1.731033 1.376581 -0.033658
H  2.975359 1.935484 -1.190405
H  5.025542 0.386335 -1.557522
H  5.057042 -1.145478 -0.622692
H  -3.201255 3.19023 0.951263
H  -3.292546 1.674712 1.893469
H  -5.391879 0.082177 1.522068
H  -6.637207 0.578505 0.338525
H  3.294564 1.685356 1.877749
H  3.196882 3.201887 0.937864
H  6.635949 0.597874 0.309727
H  5.395353 0.09748 1.496586
H  -5.610754 2.5780 1.557404
H  -5.349283 2.650239 -0.203145
H  5.341896 2.667804 -0.224888
H  5.609789 2.593655 1.534613
H  -2.094653 -1.550957 1.140835
H  -1.26604 -2.979475 0.384205
H  1.27872 -2.975064 0.373152
H  2.109342 -1.545135 1.125358
H  0.016119 -3.265313 2.715128
H  -0.8776 -1.807511 3.276539
H  0.90941 -1.804586 3.269728
