program: Gaussian 09
title: 000191503
version: EM64L-G09RevD.01
frameworkgroup: C1[X(C17H18N5O7P)]
method: RPBEPBE
basis: SDD
operation: Freq
keyword: #p
keyword: freq=noraman
keyword: PBEPBE/SDD
title: #p freq=noraman PBEPBE/SDD
converged: YES YES NO NO
title: Mulliken charges:
elementType: P O O O O O O O N N N N N C C C C C C C C C C C C C C C C C H H H H H H H H H H H H H H H H H H
charge: 1.366322 -0.248919 -0.420557 -0.533731 -0.755149 -0.646470 -0.635314 -0.189891 -0.199467 -0.323203 -0.039939 0.021879 -0.464126 -0.122457 -0.075277 -0.125682 -0.546544 -0.301538 0.132000 -0.075086 0.037017 0.211234 -0.369808 0.149843 0.263946 -0.339114 -0.350226 -0.229486 -0.243384 -0.225738 0.259552 0.280812 0.286816 0.272111 0.306507 0.261199 0.219329 0.348302 0.333468 0.260265 0.396859 0.418954 0.388107 0.269472 0.269160 0.232461 0.242975 0.232512
chargesum: 0.00000
title: Mulliken charges with hydrogens summed into heavy atoms:
elementType: P O O O O O O O N N N N N C C C C C C C C C C C C C C C C C
charge: 1.366322 -0.248919 -0.072254 -0.533731 -0.755149 -0.258363 -0.635314 -0.189891 -0.199467 0.095751 -0.039939 0.021879 -0.067267 0.137095 0.205535 0.161134 0.032074 0.178990 0.132000 0.258381 0.037017 0.211234 -0.109544 0.149843 0.263946 -0.069641 -0.081066 0.002975 -0.000408 0.006775
polarizability: 3.77001476e+02 -1.95844447e+01 2.68161922e+02 7.53981733e+00 3.81141555e+00 1.70755066e+02
1716.lowfreq: -9.0582 -5.4301 -0.0004 0.0011 0.0013 2.9938 16.2511 24.0538 36.7807
frequency: 16.1270 24.0119 36.7344 45.8024 51.6102 67.2325 78.6231 82.4228 101.9051 118.8816 134.4640 142.0467 157.8218 162.6331 172.1296 175.1437 202.7701 209.6164 229.0566 245.1976 274.6334 286.3454 287.4634 305.3234 329.2616 338.9390 346.0763 368.3510 372.9068 390.2121 403.0224 404.9661 409.3926 453.7247 475.5672 477.0565 520.4736 526.9897 550.4363 576.0012 583.2065 608.9835 612.2612 647.8878 652.1677 662.0065 686.5478 690.8023 708.2259 711.7576 732.0223 741.1024 749.0335 752.0023 769.8387 785.7801 789.8829 828.3520 830.6983 841.5821 846.7393 862.8394 867.8446 889.5907 901.1351 932.9572 935.9793 952.0613 957.7573 983.8534 988.4602 994.6990 999.6990 1009.2286 1012.2899 1014.8455 1031.3318 1033.9180 1051.3191 1062.9918 1085.4911 1091.9577 1110.3619 1115.5601 1140.7433 1174.3633 1178.6720 1194.1220 1195.9078 1197.2507 1219.5843 1228.7447 1240.3701 1251.0497 1276.0446 1284.6392 1290.4432 1303.6700 1309.7384 1320.6637 1325.6726 1342.3584 1348.7354 1371.7327 1377.0716 1383.8731 1387.0682 1419.4022 1435.2678 1473.2531 1477.5743 1479.3591 1484.1240 1499.3962 1525.9337 1553.1172 1574.1506 1582.9733 1595.7964 1609.7394 1644.0200 2972.2934 3028.3009 3045.5791 3086.7290 3091.7821 3098.7879 3110.7718 3129.5260 3134.6001 3147.0699 3160.1320 3170.5537 3177.2037 3278.5269 3285.9585 3538.1464 3593.0457
redmass: 7.1992 7.9237 7.2798 5.1733 4.5276 7.2478 5.8919 6.9333 8.3409 6.2159 6.1555 4.9216 6.4905 5.5967 2.5738 5.7769 5.9623 5.8840 5.7941 4.2521 3.7548 3.8393 3.2275 5.9734 6.0105 6.6990 7.3738 3.7480 4.6152 1.5599 3.8127 3.4586 5.1705 3.3304 5.2552 4.1433 3.6517 5.5455 4.5158 5.1300 6.2934 5.2266 6.4269 4.8693 8.6682 5.6268 4.9093 3.8671 2.0648 5.6567 4.1405 3.6099 5.1577 4.7449 3.4068 6.8190 2.2068 1.8375 3.1413 2.3587 2.8568 1.7019 1.7807 3.3831 4.8179 2.2206 1.5028 1.7707 3.6877 2.5922 5.6094 1.4138 2.9998 1.5081 3.2257 1.9315 2.3385 2.8893 2.2653 2.9474 3.3530 1.6880 4.2341 2.2895 2.3872 1.0638 1.4100 1.5689 1.2049 1.4976 1.1387 1.3800 3.7219 1.9052 1.6753 2.1474 3.0671 1.7284 1.8674 2.0258 1.8145 1.3013 1.7006 1.2667 2.4036 1.1857 8.0865 2.9344 2.2558 2.1494 1.1541 1.1498 2.2045 2.8219 1.7408 4.1595 1.6207 3.1175 2.6541 5.6290 3.5972 1.0578 1.1038 1.0621 1.0897 1.0881 1.0902 1.1021 1.0863 1.0896 1.0917 1.0960 1.1013 1.0927 1.0817 1.1007 1.0659 1.0661
irintensity: 1.3889 0.5416 2.5706 0.4701 2.7046 2.4130 1.9762 2.2565 4.2881 5.8607 7.3523 8.4437 3.3644 10.6887 16.2372 8.6129 8.7586 0.3502 4.9176 19.6725 44.7636 24.2996 42.9811 18.0692 98.0824 69.9934 1.1356 61.5815 11.4011 68.0499 25.6849 10.5081 1.5207 64.1118 7.5604 16.2301 58.5042 11.6963 36.6710 51.1547 3.5597 80.2069 0.1912 62.5909 3.1985 93.8155 25.8232 110.9569 109.5494 15.7811 315.4648 320.7531 333.9752 17.5065 34.7140 22.4327 87.9216 40.7336 45.3136 133.6811 26.0088 23.8284 37.8788 47.0053 62.0208 36.0586 3.7083 32.8421 139.6030 52.0509 5.8687 2.6905 37.8831 13.2697 85.8344 50.2694 129.2162 37.2960 59.7058 86.3536 13.9743 10.9554 99.9148 98.8947 294.6295 9.6630 29.6980 56.7826 22.2432 18.5418 21.4144 80.6583 448.2075 95.0425 26.5209 8.5749 81.7527 129.7549 5.5593 11.5123 6.7060 16.7340 72.9821 0.6688 57.5631 36.8657 1.5969 233.0724 4.8622 109.8917 8.6504 15.9164 82.2317 75.8695 296.5079 11.6487 448.5703 143.9828 440.7253 44.6860 294.6161 25.2023 20.2752 12.2569 24.0840 3.2372 14.0394 5.4571 0.0645 4.9606 11.1024 12.5452 29.3272 10.6262 227.3064 40.7983 15.5403 63.2595
temp: 298.150 k
press: 1.00000 atm
elementType: 15 8 8 8 8 8 8 8 7 7 7 7 7 6 6 6 6 6 6 6 6 6 6 6 6 6 6 6 6 6 1 1 1 1 1 1 1 1 1 1 1 1 1 1 1 1 1 1
symmnumber: 1
zpe: 917619.9 jmol-1
zpe.correction: 0.349503 hartree
zpe.thermalcorrener: 0.376135 hartree
zpe.thermalcorrenthalpy: 0.377080 hartree
zpe.thermalcorrgfe: 0.291493 hartree
zpe.sumelectzpe: -1797.969827 hartree
zpe.sumelectthermal: -1797.943194 hartree
zpe.sumelectthermalent: -1797.942250 hartree
zpe.sumelectthermalfe: -1798.027837 hartree
dipole: 5.7533 1.3088 1.0672
dipole: 5.9960
quadrupole: -160.1166 -187.8966 -189.1896
quadrupole: -14.3474 8.7111 -5.8138
quadrupole: 18.9510 -8.8290 -10.1220 -14.3474 8.7111 -5.8138
hfenergy: -1798.3193298 hartree
pointgroup: C01 [X(C17H18N5O7P1)]
dipole: -2.2626446 -0.4180676 -0.5202517 debye
polarizability: 344.0142972|52.6270735|299.9175221|17.048083|7.4772839|171.9866445 unknown
InChI: InChI=1S/C17H18N5O7P/c23-11-6-13-21-9-22(31-29-30(25,26)27-7-12(11)28-13)14-15(18-8-19-16(14)21)20-17(24)10-4-2-1-3-5-10/h1-5,8-9,11-13,20,23,25H,6-7H2
charge 0 multiplicity 1
48 atoms
P  -1.07013 2.41195 -0.133308
O  -4.199937 -0.968695 -0.933816
O  -5.79278 -1.81397 1.545568
O  -2.510958 1.365419 -0.313704
O  0.064313 1.807888 -1.171213
O  -1.641728 3.799282 -0.970605
O  -0.669615 2.604679 1.397889
O  4.307599 -1.040772 0.036249
N  -2.045464 -1.93658 -1.227435
N  -0.491395 -0.435914 -1.889596
N  -0.570715 -3.346253 0.239485
N  1.664367 -2.353906 0.517718
N  2.156409 -0.150596 -0.331108
C  -4.363445 -1.558897 1.351879
C  -3.480094 -2.242396 -0.851916
C  -4.128111 -0.334031 0.428995
C  -3.646332 -2.735693 0.6101
C  -2.813147 0.403714 0.761271
C  -0.829209 -2.305223 -0.594701
C  -1.773025 -0.83061 -2.013457
C  0.117007 -1.319074 -0.981064
C  1.363747 -1.286476 -0.287382
C  0.723131 -3.322839 0.70196
C  3.533366 -0.051374 0.056982
C  3.965781 1.332732 0.438014
C  5.353783 1.626981 0.370463
C  3.057134 2.323758 0.899657
C  5.827405 2.900935 0.738888
C  3.538765 3.596931 1.274446
C  4.919229 3.890547 1.189204
H  -3.979045 -1.413473 2.373061
H  -3.914433 -2.903732 -1.616224
H  -4.971324 0.373292 0.445045
H  -4.287871 -3.630561 0.650302
H  -2.682493 -3.006416 1.067131
H  -2.958722 0.937787 1.720983
H  -1.969361 -0.300825 0.906167
H  -6.227303 -1.879522 0.655388
H  -2.542207 -0.284054 -2.547428
H  1.024663 -4.170319 1.323597
H  1.677208 0.720107 -0.631333
H  -0.201722 0.738867 -1.797494
H  -2.25822 4.365048 -0.439484
H  6.037476 0.840759 0.03325
H  1.985914 2.116219 1.005844
H  6.897854 3.12511 0.678597
H  2.833997 4.351818 1.6380
H  5.287238 4.881481 1.47814
