program: Gaussian 09
title: 000191272
version: EM64L-G09RevD.01
frameworkgroup: C1[X(C16H22O3)]
method: RPBEPBE
basis: SDD
operation: Freq
keyword: #pfreq=noraman
keyword: PBEPBE/SDD
title: #p freq=noraman PBEPBE/SDD
converged: NO YES NO NO
title: Mulliken charges:
elementType: O O O C C C C C C C C C C C C C C C C H H H H H H H H H H H H H H H H H H H H H H
charge: -0.255302 -0.472108 -0.239550 0.204592 -0.359728 0.255059 -0.113967 0.530157 0.204836 -0.466124 -0.833844 -0.305431 -0.085341 -0.772165 -0.412950 -0.475385 -0.514155 -0.328463 -0.731088 0.219641 0.214514 0.227402 0.185638 0.231580 0.237814 0.269265 0.244563 0.246022 0.220655 0.238194 0.245804 0.222599 0.227182 0.245096 0.242422 0.213129 0.228994 0.212740 0.212812 0.221264 0.363628
chargesum: 0.00000
title: Mulliken charges with hydrogens summed into heavy atoms:
elementType: O O O C C C C C C C C C C C C C C C C
charge: -0.255302 -0.108480 -0.239550 0.204592 -0.140087 0.255059 0.100547 0.530157 0.204836 -0.053085 -0.095185 -0.060868 0.160681 -0.067512 -0.185768 -0.252786 -0.026637 0.113660 -0.084272
polarizability: 2.37114861e+02 -2.86936675e+00 1.49733013e+02 8.68817258e+00 3.41236400e+00 1.49692451e+02
1716.lowfreq: -22.0724 -15.5315 -9.1042 -0.0008 -0.0007 -0.0004 38.9220 84.2442 113.1992
frequency: 37.9827 84.2396 113.1866 119.2491 146.7948 168.1352 184.1202 207.9973 214.6244 227.3867 239.2417 244.1880 260.9088 273.5381 289.6748 299.0135 323.2103 340.9337 362.9807 380.6173 402.3971 427.1261 466.1604 471.1283 480.3443 521.5855 537.3658 550.7676 577.3189 592.3170 651.3441 661.0296 690.9027 712.4328 721.0993 766.0582 783.2741 822.4906 830.2190 851.0842 867.3011 882.0686 900.8930 909.7141 923.9861 934.6770 961.8908 975.2064 981.1901 1010.3460 1022.3533 1037.4395 1047.5030 1077.1810 1078.3200 1087.0709 1094.2449 1107.7095 1124.4892 1129.1833 1158.1677 1166.8526 1183.1712 1195.1085 1212.8330 1220.0149 1230.9535 1246.0043 1250.6549 1268.2471 1286.1326 1299.4539 1302.2956 1313.4941 1317.3776 1354.9547 1359.1039 1370.0649 1377.1278 1380.7265 1387.0626 1392.5111 1407.9910 1432.2538 1452.2880 1456.0190 1467.0272 1469.4463 1473.1833 1477.3075 1480.4254 1488.8054 1591.8225 1612.3541 1652.4227 2932.2651 2949.4652 2968.8416 2970.8943 2977.5701 2985.0450 2995.7777 2997.0171 3000.3374 3050.5302 3065.0817 3071.9409 3078.0400 3079.5426 3080.5343 3084.1660 3093.6312 3096.8768 3097.9254 3106.2350 3126.7663 3278.6026
redmass: 3.9462 5.0217 3.8052 3.2345 3.3103 3.7719 1.2036 1.7803 1.5203 2.7518 2.3426 2.3526 2.5925 2.8933 2.0464 2.3111 3.3660 3.4708 3.0489 3.5500 3.8236 4.2399 3.1987 3.3640 3.4983 2.8980 4.4501 2.8854 4.3791 3.1618 1.3768 4.8590 2.3540 3.1595 4.1834 2.8974 1.5461 2.3870 2.2633 2.7342 1.5653 1.8926 1.9091 2.3454 2.7282 1.8830 1.7056 2.5224 1.3165 1.6531 2.1044 3.7083 2.5456 1.9785 2.6308 2.0076 2.5280 2.0888 2.0424 2.4345 2.4145 1.8129 1.7680 1.5726 1.2950 2.1853 1.4966 1.4219 1.5850 1.3454 1.5873 1.5630 1.4005 1.4057 1.4714 1.4543 1.2761 1.6878 1.3125 1.3787 1.2735 1.4076 1.2053 1.0899 1.0937 1.0526 1.0722 1.0601 1.0492 1.0534 1.0564 1.0496 9.3469 7.7362 8.1253 1.0803 1.0800 1.0512 1.0486 1.0666 1.0367 1.0631 1.0789 1.0378 1.0980 1.0998 1.0994 1.0974 1.0980 1.0904 1.1012 1.1009 1.0921 1.0920 1.0997 1.0976 1.0684
irintensity: 1.2491 4.4425 3.9145 4.0809 2.0753 3.6364 0.1822 0.2532 1.5569 3.3704 0.4376 0.6103 1.3109 0.9018 1.4751 2.8756 2.9860 0.3990 2.1560 4.9340 6.8615 1.7785 6.6719 4.3007 0.6263 14.8721 3.5878 6.6698 3.8651 4.4617 103.4737 14.9911 61.5165 1.2602 8.5774 27.1786 11.8521 2.0817 13.5932 5.5409 31.3971 2.3589 7.2595 8.7352 8.4187 3.1538 10.1068 18.5194 2.4003 0.4939 15.1395 13.0406 55.1943 1.2460 41.5357 16.6968 12.1520 37.6986 9.7945 23.2024 8.8569 23.4709 12.9304 5.8541 5.1832 39.0601 7.4033 2.1578 1.9622 1.8750 13.1825 3.8434 17.1293 3.1843 19.6252 3.6655 6.2141 4.8541 18.0236 13.7007 9.6573 17.9812 65.6604 25.1054 8.6560 6.8431 19.6982 7.4613 12.5094 9.6903 12.8807 2.2595 100.5544 12.7742 26.2656 5.6447 4.4867 11.8651 71.1434 49.3784 7.6383 8.1670 70.6934 37.7908 27.6829 37.5975 37.9584 43.5386 4.1730 28.4931 24.5386 8.4795 15.9583 2.0724 28.3566 27.3017 286.3693
temp: 298.150 k
press: 1.00000 atm
elementType: 8 8 8 6 6 6 6 6 6 6 6 6 6 6 6 6 6 6 6 1 1 1 1 1 1 1 1 1 1 1 1 1 1 1 1 1 1 1 1 1 1
symmnumber: 1
zpe: 909209.6 jmol-1
zpe.correction: 0.346300 hartree
zpe.thermalcorrener: 0.364157 hartree
zpe.thermalcorrenthalpy: 0.365101 hartree
zpe.thermalcorrgfe: 0.302920 hartree
zpe.sumelectzpe: -847.086990 hartree
zpe.sumelectthermal: -847.069132 hartree
zpe.sumelectthermalent: -847.068188 hartree
zpe.sumelectthermalfe: -847.130370 hartree
dipole: 1.6322 -2.4775 0.3712
dipole: 2.9900
quadrupole: -110.3816 -119.9024 -111.0004
quadrupole: 8.2645 -4.4207 3.0200
quadrupole: 3.3798 -6.1409 2.7611 8.2645 -4.4207 3.0200
hfenergy: -847.4332895 hartree
pointgroup: C01 [X(C16H22O3)]
dipole: 0.6400269 -0.983235 0.0859682 debye
polarizability: 237.065571|-3.5887246|149.3195051|8.6775056|3.3638954|150.1552482 unknown
InChI: InChI=1S/C16H22O3/c1-10-8-11-4-6-15(2)16(3,13(18)5-7-19-15)14(11)12(17)9-10/h4,6,8,10,12,14,17H,5,7,9H2,1-3H3
charge 0 multiplicity 1
41 atoms
O  3.239273 -0.485029 0.270691
O  -1.623318 2.267472 0.338778
O  0.193798 1.622859 -1.479813
C  0.897183 0.453163 0.592502
C  -0.591121 -0.031058 0.772864
C  1.826585 -0.849617 0.600972
C  -1.657124 1.046159 1.146854
C  -1.016741 -0.934104 -0.387348
C  1.134102 1.174228 -0.759362
C  -3.070184 0.418717 1.076607
C  1.302939 1.440145 1.72463
C  1.300732 -1.844129 -0.425895
C  -3.407726 -0.066341 -0.354438
C  1.988456 -1.505355 1.987658
C  0.012575 -1.849792 -0.886257
C  -2.293498 -0.949107 -0.878886
C  2.575777 1.384622 -1.196512
C  3.397834 0.083042 -1.070052
C  -4.780132 -0.777858 -0.416074
H  -0.557092 -0.683937 1.671905
H  -1.465728 1.380655 2.185034
H  -3.802106 1.182122 1.397801
H  -3.139256 -0.435553 1.782484
H  1.009211 1.032886 2.708627
H  2.39463 1.601249 1.735427
H  0.790162 2.408934 1.594635
H  2.024346 -2.597976 -0.764425
H  -3.465016 0.83809 -1.001114
H  1.018666 -1.784434 2.430568
H  2.590902 -2.423297 1.879352
H  2.523184 -0.82769 2.674415
H  -2.537619 -1.637891 -1.702672
H  -0.291159 -2.591141 -1.637839
H  2.578727 1.772342 -2.229652
H  3.027143 2.150457 -0.535508
H  3.079749 -0.642447 -1.845704
H  4.477421 0.2772 -1.176948
H  -5.025827 -1.086992 -1.44951
H  -4.786707 -1.682658 0.220662
H  -5.584048 -0.106152 -0.063011
H  -1.181194 2.059516 -0.538946
