program: Gaussian 09
title: 000191275
version: EM64L-G09RevD.01
frameworkgroup: C1[X(C16H16N2O3)]
method: RPBEPBE
basis: SDD
operation: Freq
keyword: #p
keyword: freq=noraman
keyword: PBEPBE/SDD
title: #p freq=noraman PBEPBE/SDD
converged: YES YES NO NO
title: Mulliken charges:
elementType: O O O N N C C C C C C C C C C C C C C C C H H H H H H H H H H H H H H H H
charge: -0.321731 -0.261113 -0.243851 -0.123821 -0.348848 -0.559485 0.519637 -0.427461 -0.376383 0.286745 -0.222982 -0.228378 -0.238458 0.403995 0.277874 -0.324174 -0.393419 -0.757573 -0.208422 -0.196078 -0.247341 0.266129 0.263567 0.237692 0.248460 0.326911 0.227949 0.228291 0.230764 0.284342 0.254046 0.258961 0.217414 0.256788 0.229045 0.230534 0.230377
chargesum: 0.00000
title: Mulliken charges with hydrogens summed into heavy atoms:
elementType: O O O N N C C C C C C C C C C C C C C C C
charge: -0.321731 -0.261113 -0.243851 -0.123821 -0.021938 -0.029789 0.519637 -0.189770 -0.127923 0.286745 0.004967 -0.000087 -0.007694 0.403995 0.277874 -0.039832 -0.139373 -0.024410 0.020623 0.034456 -0.016964
polarizability: 2.57992705e+02 -1.20801277e+01 1.96135219e+02 5.64420255e+00 1.05411069e+00 1.25483281e+02
1716.lowfreq: -7.3444 -6.4985 -0.0002 0.0002 0.0004 6.1664 8.4708 11.7263 21.3183
frequency: 5.9086 9.7307 21.0054 22.3709 41.6543 60.4944 65.7285 70.1190 83.1377 126.3554 142.3732 198.0527 221.0294 250.5963 271.7867 332.3601 338.2764 365.7054 400.8282 402.4042 408.3126 446.4527 474.5685 494.1696 516.8644 539.2656 585.2007 595.9860 608.6157 616.8471 653.7133 678.6744 684.6487 691.6610 707.2054 755.3236 758.6957 783.9050 814.4414 831.8959 842.9320 857.4739 909.4114 918.4561 922.4643 960.0901 966.7437 980.2988 986.3417 989.8540 990.6256 992.6349 999.0466 1019.8634 1026.1349 1038.4450 1038.9833 1080.6893 1090.4269 1160.5469 1170.3326 1172.8779 1177.9417 1187.3602 1191.3127 1215.3687 1223.9194 1273.5239 1310.7065 1320.9641 1350.7128 1367.4232 1384.9159 1386.7650 1387.5510 1441.6588 1442.0053 1448.9764 1454.8277 1468.4475 1473.6200 1474.6263 1486.9679 1595.0199 1595.3741 1608.4435 1615.1752 1631.2324 1652.5031 3000.3620 3022.2702 3086.8374 3101.7986 3104.7432 3119.4972 3121.6626 3132.3680 3134.6172 3143.5125 3146.6983 3160.3618 3163.7236 3173.3083 3201.0759 3532.2100
redmass: 4.6565 3.8480 4.2858 5.0715 4.3210 3.6798 2.2217 2.1310 5.6742 4.4976 6.2454 5.0755 5.2052 4.6421 4.7282 5.0785 5.4573 3.0810 2.7465 2.7988 2.8914 2.2859 2.3902 3.0234 3.1524 5.0228 5.6029 3.2792 6.3618 6.1897 4.4723 8.9679 4.8728 2.3784 1.7171 2.3737 1.7156 4.1522 3.5750 1.2712 5.0325 1.2475 1.4524 2.3778 1.9124 2.2906 1.3747 1.3969 2.7746 1.7988 4.9766 1.7697 1.3753 2.5825 2.2124 1.6454 2.8082 1.5110 1.6161 2.0635 1.1073 1.0788 1.8677 1.2181 1.4332 2.6027 2.6533 3.3235 1.3236 1.4626 1.4735 2.2404 8.6625 1.2353 5.8762 2.1362 2.2588 1.0460 1.4897 1.1224 1.3725 1.8448 1.9603 6.3205 6.1165 6.5655 6.0441 8.4865 9.4801 1.0358 1.0609 1.1025 1.0992 1.0998 1.0861 1.0878 1.0853 1.0916 1.0903 1.0961 1.0951 1.1015 1.0992 1.0951 1.0794
irintensity: 0.1607 0.0567 0.1021 1.2227 3.2598 8.1817 2.6120 1.7217 1.5746 0.5377 7.3287 2.9823 1.7701 3.8193 0.9008 2.1891 6.7586 3.5224 3.0834 0.1403 0.2886 21.8905 26.8950 12.8054 122.7041 21.2548 3.5548 0.4900 2.0256 0.3856 15.3530 10.2114 6.7080 31.7931 68.5232 47.1521 50.9749 21.3047 9.3084 3.1365 55.3280 0.1032 5.8269 2.4730 0.9632 15.4381 0.2456 0.2490 3.6431 2.6226 0.2302 7.0370 0.6209 0.5393 3.0595 11.9254 144.6456 11.1577 75.1933 394.3078 53.0616 9.3172 178.7961 71.6618 143.6267 20.5511 125.8145 91.3709 2.2742 61.0518 52.8063 166.9313 6.9779 60.3646 37.5768 7.7579 8.1275 18.1204 107.1888 17.7791 49.7817 75.9925 7.5659 13.3436 8.0415 20.9071 2.1793 159.3518 284.9539 7.4974 15.5058 2.3381 10.8282 13.1443 6.1682 1.4416 0.1486 11.9587 15.8900 36.6142 30.8015 23.2454 10.1976 0.9281 21.2709
temp: 298.150 k
press: 1.00000 atm
elementType: 8 8 8 7 7 6 6 6 6 6 6 6 6 6 6 6 6 6 6 6 6 1 1 1 1 1 1 1 1 1 1 1 1 1 1 1 1
symmnumber: 1
zpe: 757854.8 jmol-1
zpe.correction: 0.288652 hartree
zpe.thermalcorrener: 0.308406 hartree
zpe.thermalcorrenthalpy: 0.309350 hartree
zpe.thermalcorrgfe: 0.233535 hartree
zpe.sumelectzpe: -952.961652 hartree
zpe.sumelectthermal: -952.941898 hartree
zpe.sumelectthermalent: -952.940954 hartree
zpe.sumelectthermalfe: -953.016769 hartree
dipole: -1.0999 0.2323 -4.7245
dipole: 4.8564
quadrupole: -102.6217 -116.1786 -128.2294
quadrupole: -1.6546 0.4148 -6.4079
quadrupole: 13.0549 -0.5020 -12.5528 -1.6546 0.4148 -6.4079
hfenergy: -953.2503041 hartree
pointgroup: C01 [X(C16H16N2O3)]
dipole: 0.380732 0.0806076 -1.8705897 debye
polarizability: 256.812282|-12.9853248|196.3345788|-10.4625033|6.4768149|126.4643431 unknown
InChI: InChI=1S/C16H16N2O3/c1-13(19)17-18(12-14-8-4-2-5-9-14)16(20)21-15-10-6-3-7-11-15/h2-11,17H,12H2,1H3
charge 0 multiplicity 1
37 atoms
O  -1.603868 -0.166683 -0.088057
O  -0.702287 1.137468 1.682519
O  0.540404 -3.109909 0.987672
N  0.611075 -0.363476 0.458227
N  0.664002 -1.349313 -0.532443
C  1.830773 -0.146135 1.282064
C  2.973851 0.457742 0.478069
C  4.159469 -0.2795 0.243222
C  2.865457 1.772118 -0.046193
C  -0.585394 0.274402 0.781653
C  5.222479 0.283934 -0.501113
C  3.922654 2.336132 -0.792029
C  5.105563 1.592559 -1.021845
C  -2.938796 0.343185 -0.020092
C  0.596115 -2.708338 -0.20722
C  -3.270239 1.655811 0.383636
C  -3.921536 -0.560678 -0.47738
C  0.628001 -3.640181 -1.412524
C  -4.626173 2.052929 0.324008
C  -5.268763 -0.14431 -0.532673
C  -5.626567 1.164612 -0.131842
H  2.117305 -1.118825 1.719994
H  1.517119 0.523796 2.100625
H  4.25141 -1.295726 0.646467
H  1.953727 2.353143 0.140322
H  0.669206 -1.031953 -1.503942
H  6.136726 -0.295152 -0.673125
H  3.830887 3.354025 -1.187489
H  5.928079 2.031507 -1.597653
H  -2.502471 2.336008 0.755067
H  -3.619959 -1.568918 -0.776446
H  -0.265951 -4.286027 -1.382654
H  0.654335 -3.110621 -2.380269
H  1.511997 -4.296754 -1.340991
H  -4.896273 3.066518 0.640093
H  -6.035489 -0.842778 -0.884879
H  -6.672565 1.486489 -0.172072
