program: Gaussian 09
title: 000191245
version: EM64L-G09RevD.01
frameworkgroup: C1[X(C20H23NO3)]
method: RPBEPBE
basis: SDD
operation: Freq
keyword: #p
keyword: freq=noraman
keyword: PBEPBE/SDD
title: #p freq=noraman PBEPBE/SDD
converged: YES YES NO NO
title: Mulliken charges:
elementType: O O O N C C C C C C C C C C C C C C C C C C C C H H H H H H H H H H H H H H H H H H H H H H H
charge: -0.434697 -0.373884 -0.257996 -0.188793 0.156697 0.153661 -0.540088 0.349772 -0.540203 0.333413 -0.401728 -0.388451 -0.691369 -0.689004 -0.391085 -0.364916 0.410068 -0.438274 -0.366007 -0.358660 -0.401865 0.278626 0.207112 -0.751050 0.247137 0.212248 0.214430 0.249005 0.232894 0.243589 0.216154 0.230925 0.211434 0.211270 0.219357 0.231674 0.234673 0.241271 0.266053 0.302992 0.249508 0.219566 0.353310 0.259531 0.226757 0.249544 0.365398
chargesum: 0.00000
title: Mulliken charges with hydrogens summed into heavy atoms:
elementType: O O O N C C C C C C C C C C C C C C C C C C C C
charge: -0.081387 -0.008486 -0.257996 -0.188793 0.156697 0.153661 -0.080703 0.349772 -0.076768 0.333413 -0.168834 -0.144862 -0.032856 -0.026703 -0.156412 -0.123645 0.410068 -0.172221 -0.063015 -0.109151 -0.182299 0.278626 0.207112 -0.015218
polarizability: 4.17447286e+02 2.36690447e+00 1.94578221e+02 2.26103927e-01 5.17193241e+00 1.75186353e+02
1716.lowfreq: -12.1581 -4.7347 -3.8430 -0.0005 0.0006 0.0010 22.2094 24.1918 30.9022
frequency: 22.1736 23.9297 30.8638 43.1147 58.9632 61.5934 73.7012 84.8311 88.5880 111.3420 129.4821 136.2608 152.2263 169.4933 188.3489 190.8300 199.5421 223.9258 254.8002 277.1392 291.4092 313.5858 329.9398 344.3130 358.5874 365.9792 382.0175 389.7542 393.6604 411.0461 411.7919 448.6468 500.1654 508.4088 515.1073 544.7302 556.0131 564.2914 575.9439 615.2270 628.3919 638.3664 669.1671 679.3157 732.4194 739.2874 750.2920 775.2744 798.6188 807.9543 825.0466 837.1695 841.6762 859.8653 898.1445 910.6138 931.4572 947.0761 960.0630 961.4108 981.5139 994.5695 1001.5004 1007.9169 1009.1215 1019.6757 1030.1535 1049.2970 1066.7985 1082.6933 1090.0499 1107.4853 1114.3198 1132.1812 1143.8030 1178.7856 1186.8141 1211.7020 1241.8122 1246.3240 1249.5174 1276.8524 1282.6435 1292.8882 1304.0909 1308.6502 1318.6761 1321.7644 1340.0190 1366.7095 1373.8998 1381.4044 1384.2821 1385.5959 1413.4728 1417.9258 1445.2856 1455.9666 1468.6401 1469.7695 1471.6227 1473.2498 1484.3200 1484.5508 1489.9339 1498.3576 1558.4806 1585.5122 1599.4916 1612.1596 1619.3498 1621.6359 2969.9421 2972.0529 2977.3290 2978.6313 3002.2458 3055.4738 3056.4760 3071.8471 3073.9974 3083.1452 3084.5259 3091.0948 3111.3305 3132.4711 3134.1961 3136.5973 3144.2773 3148.9324 3169.3719 3176.4635 3204.1951 3435.9198 3582.0314
redmass: 4.9194 5.7635 5.3537 3.5669 4.0977 4.3829 3.5049 3.0738 2.7220 3.6625 1.2653 2.7515 3.7607 4.5912 1.2383 1.3137 4.1162 3.5297 3.4706 2.9529 1.1280 3.2248 3.3497 4.4550 1.1169 4.0307 3.8074 3.7278 6.0774 2.9634 3.0478 4.0030 4.2316 3.5661 3.2362 3.0754 3.2277 4.2034 5.7437 3.4490 6.1704 6.2857 3.8117 4.5899 3.7481 3.7076 2.7422 1.2454 1.7470 1.8854 1.8626 1.6069 1.3709 1.5346 5.0828 2.4007 1.4343 1.8242 1.3576 1.3897 1.3325 2.6309 2.9398 2.5881 3.5570 2.1903 1.6890 2.3189 1.8060 1.9539 1.7279 1.8661 1.8129 1.4243 1.3595 1.1093 1.4462 1.9853 1.8661 2.1376 1.2956 1.8589 2.4839 2.1047 1.4058 1.3636 1.5470 1.4142 2.5293 3.5321 4.2190 1.2198 1.2018 1.2085 3.6304 3.3750 1.0904 1.0484 1.0719 1.0651 1.0504 1.0484 1.0757 1.0836 2.4274 2.7439 7.1967 6.3232 7.7866 6.3791 7.7146 6.9852 1.0669 1.0667 1.0352 1.0351 1.0374 1.0927 1.0929 1.1001 1.1002 1.0993 1.0994 1.0962 1.0889 1.0895 1.0888 1.1011 1.0902 1.0946 1.0957 1.0935 1.0942 1.0682 1.0660
irintensity: 0.0523 2.1682 1.5527 1.2704 3.2930 0.2672 0.7349 0.6860 0.5441 2.3739 0.8296 5.2362 4.3512 0.5692 1.1365 2.0554 1.4356 7.3911 1.9127 3.0702 127.3300 15.0087 4.3388 4.9188 139.5729 12.1553 16.6704 0.2358 4.4114 0.9518 0.5791 2.9953 3.4880 10.4730 12.3743 19.7496 7.1134 23.9983 2.1336 1.5866 2.1879 3.7810 14.7843 1.1509 1.2902 2.8350 17.6628 0.3429 20.4651 19.8625 34.6218 31.4046 24.6866 50.6340 10.2794 5.0584 0.2966 1.4745 1.0218 2.0849 0.9256 18.3459 3.9211 39.3067 9.1575 3.6315 8.3380 4.1635 1.9436 8.0434 14.0259 54.2906 16.1769 8.3636 267.3883 12.4694 0.9984 29.9538 18.6614 19.5753 2.3763 9.1826 3.3298 266.7598 26.0893 12.2736 6.7318 29.7673 161.3907 114.7311 24.0983 37.5552 9.9110 20.2068 16.6168 3.2643 22.4685 18.0308 5.4657 6.1408 2.4933 5.1489 22.9023 11.1972 96.1202 153.7184 2.0924 9.2706 149.4794 2.0189 35.3488 24.8065 25.3082 27.7456 36.3578 30.6299 8.4522 3.6278 4.3919 49.4812 41.6252 34.2459 77.4388 11.7154 24.1467 14.1245 11.2164 8.8602 8.2512 10.8404 9.0806 3.8273 3.7843 7.0022 52.4389
temp: 298.150 k
press: 1.00000 atm
elementType: 8 8 8 7 6 6 6 6 6 6 6 6 6 6 6 6 6 6 6 6 6 6 6 6 1 1 1 1 1 1 1 1 1 1 1 1 1 1 1 1 1 1 1 1 1 1 1
symmnumber: 1
zpe: 998757.2 jmol-1
zpe.correction: 0.380407 hartree
zpe.thermalcorrener: 0.405193 hartree
zpe.thermalcorrenthalpy: 0.406138 hartree
zpe.thermalcorrgfe: 0.324198 hartree
zpe.sumelectzpe: -1054.538515 hartree
zpe.sumelectthermal: -1054.513728 hartree
zpe.sumelectthermalent: -1054.512783 hartree
zpe.sumelectthermalfe: -1054.594723 hartree
dipole: -0.6212 -3.9031 0.9831
dipole: 4.0727
quadrupole: -126.1577 -141.8261 -139.6470
quadrupole: 13.2360 13.3072 -4.7347
quadrupole: 9.7192 -5.9492 -3.7701 13.2360 13.3072 -4.7347
hfenergy: -1054.9189211 hartree
pointgroup: C01 [X(C20H23N1O3)]
dipole: -0.2068146 1.3667077 -0.8104126 debye
polarizability: 417.1893143|-7.7485888|196.0744965|1.6906042|-1.0319889|173.9480492 unknown
InChI: InChI=1S/C20H23NO3/c1-4-19(20(5-2)16-8-12-18(23)13-9-16)15-6-10-17(11-7-15)21(24)14(3)22/h6-13,23-24H,4-5H2,1-3H3
charge 0 multiplicity 1
47 atoms
O  7.371395 -0.24469 -0.047195
O  -5.644898 1.538395 0.488732
O  -5.414353 -1.909188 -0.509136
N  -5.001856 0.323973 0.0069
C  0.795875 0.620291 -0.075964
C  1.628643 -0.368908 0.407405
C  1.316178 1.9308 -0.670558
C  -0.699678 0.512493 -0.023798
C  1.119566 -1.599389 1.160644
C  3.122028 -0.302572 0.266663
C  -1.492665 1.539775 0.55582
C  -1.393128 -0.590264 -0.594082
C  0.986566 2.105247 -2.176437
C  1.379624 -2.934417 0.414436
C  3.972783 -0.404803 1.404492
C  3.744159 -0.193907 -1.006294
C  -3.566089 0.35427 0.006478
C  -2.898438 1.466269 0.585485
C  -2.798348 -0.684119 -0.589432
C  5.375295 -0.375589 1.286653
C  5.148526 -0.17228 -1.145121
C  5.965301 -0.26027 0.00702
C  -5.867214 -0.772364 -0.186764
C  -7.349632 -0.488517 0.000426
H  2.405055 2.014418 -0.515399
H  0.855067 2.777127 -0.120829
H  1.637594 -1.651133 2.14051
H  0.043671 -1.498215 1.381275
H  -1.004222 2.402163 1.023422
H  -0.816961 -1.390223 -1.071506
H  1.345557 3.084048 -2.544853
H  -0.102343 2.049944 -2.355295
H  1.466412 1.315217 -2.782871
H  0.847562 -2.959198 -0.554313
H  1.030227 -3.792704 1.017052
H  2.4566 -3.073022 0.210884
H  3.529964 -0.485516 2.4037
H  3.116853 -0.143823 -1.902745
H  -3.478516 2.248623 1.081067
H  -3.301649 -1.547722 -1.024868
H  6.02379 -0.439755 2.165445
H  5.599769 -0.095185 -2.143269
H  7.685859 -0.163698 -0.981736
H  -7.559749 -0.101988 1.011678
H  -7.712469 0.268096 -0.718366
H  -7.891142 -1.431892 -0.163087
H  -5.626571 2.169003 -0.286764
