program: Gaussian 09
title: 000191229
version: EM64L-G09RevD.01
frameworkgroup: C1[X(C16H16ClNO4)]
method: RPBEPBE
basis: SDD
operation: Freq
keyword: #p
keyword: freq=noraman
keyword: PBEPBE/SDD
title: #p freq=noraman PBEPBE/SDD
converged: YES YES NO NO
title: Mulliken charges:
elementType: Cl O O O O N C C C C C C C C C C C C C C C C H H H H H H H H H H H H H H H H
charge: -0.061412 -0.268205 -0.291687 -0.479062 -0.274044 -0.457817 0.350477 0.376700 -0.268619 -0.326164 -0.336692 -0.377326 -0.384567 -0.351039 -0.419970 0.494423 -0.432157 -0.338554 0.256606 -0.183021 -0.194079 -0.120549 0.247733 0.212187 0.230064 0.246606 0.245036 0.247590 0.283140 0.226041 0.205622 0.205111 0.336769 0.231592 0.304297 0.255800 0.255174 0.353998
chargesum: 0.00000
title: Mulliken charges with hydrogens summed into heavy atoms:
elementType: Cl O O O O N C C C C C C C C C C C C C C C C
charge: -0.061412 -0.268205 -0.291687 -0.125065 -0.274044 -0.121048 0.350477 0.376700 0.191301 0.150506 -0.091656 -0.129736 -0.101427 -0.124998 -0.009238 0.494423 -0.200564 -0.034257 0.256606 0.072779 0.061095 -0.120549
polarizability: 2.81566598e+02 1.63807359e+01 1.63232373e+02 7.32341969e+00 1.82721685e+00 1.85858153e+02
1716.lowfreq: -7.8598 -3.2472 -0.0017 -0.0008 -0.0006 1.5566 8.7714 15.9513 20.6298
frequency: 8.5662 15.9012 20.5983 34.6901 37.7525 61.8138 73.8872 80.7708 122.4022 129.8929 145.3484 171.6195 193.2744 229.1942 239.5493 244.8987 266.8021 323.2213 330.2804 334.5892 356.3071 377.6232 411.1226 411.4669 422.3938 468.6633 487.4773 505.4676 509.4013 564.0039 618.7233 628.5332 644.7773 653.2813 674.3113 698.5988 704.4797 709.6437 726.5539 804.3203 807.2983 815.1946 818.1115 824.7965 841.7173 871.9905 904.9060 938.6588 939.5548 959.4303 968.6604 974.7722 990.2538 993.6212 1005.7657 1019.6108 1026.5833 1059.9140 1074.8404 1101.2739 1116.1815 1117.1412 1145.0698 1163.9364 1179.6415 1186.7878 1199.0944 1214.9604 1218.5911 1230.8825 1262.0371 1280.0476 1297.9366 1306.1579 1362.2964 1367.5203 1375.0124 1382.4901 1404.0346 1405.1330 1417.5212 1431.7354 1466.9130 1472.1103 1479.5044 1504.3256 1514.1601 1589.1314 1595.7796 1610.5509 1629.4559 1662.4130 2918.3445 2956.2967 2959.5794 3025.1219 3038.8226 3115.4789 3121.9245 3127.3030 3152.5966 3164.1856 3166.0477 3172.8872 3179.3682 3191.7767 3540.7499 3588.4741
redmass: 8.9253 4.3514 4.2232 3.7204 6.1377 6.3595 7.6350 7.1602 4.4298 5.1515 4.5615 4.6879 5.3612 5.2798 1.1715 4.6835 7.9423 4.0054 5.7062 4.2489 4.8972 3.8678 2.9953 2.9984 5.1046 4.7982 4.1463 2.7359 2.6036 4.0130 6.8493 6.9110 1.3905 5.3180 6.0136 4.3099 3.9259 3.0265 4.1425 4.5104 3.8465 1.3805 1.5547 1.3597 1.4168 4.7432 3.6210 1.3542 1.3204 2.9216 1.4088 1.3196 7.8059 4.1493 2.7228 1.7227 3.3269 3.2396 2.6211 2.3786 1.3221 1.3292 1.3424 3.3440 1.2340 1.1155 1.0621 1.2282 1.9799 2.3602 2.1327 1.1022 1.3396 1.2960 1.5896 2.7438 2.5265 1.5749 3.8179 2.2864 2.8536 1.0956 1.1151 1.0817 2.2932 2.4980 2.4170 7.1650 5.5412 6.2353 6.3902 8.1834 1.0545 1.0589 1.1056 1.0944 1.0691 1.0894 1.1046 1.0903 1.0883 1.0947 1.0906 1.0953 1.0949 1.0957 1.0762 1.0666
irintensity: 0.1878 6.1118 2.2853 7.1738 4.3392 3.3309 4.4870 0.6932 7.6843 6.3011 4.6093 2.4346 6.3068 3.6471 157.5432 8.7591 1.7046 0.6798 0.6824 21.1349 2.6372 16.3798 0.0469 0.0698 8.9915 3.9196 6.3939 39.2930 17.6756 33.6943 4.7002 0.1585 36.3443 22.6415 4.1429 35.6363 18.0277 2.6450 6.7922 7.8253 10.5818 40.2744 77.5702 6.5776 64.3084 2.7040 50.7395 1.4880 0.3359 137.8354 10.1946 2.3420 81.3604 28.9805 7.6030 0.8039 139.0486 108.4381 69.9104 4.8311 6.7405 33.9682 76.8228 507.6467 36.6246 11.9417 0.0351 69.5734 117.2337 31.3535 3.9677 11.8146 15.4718 1.8109 52.8528 56.8900 35.1550 10.8800 32.7638 1.7875 7.6316 25.6762 68.5107 6.5817 46.8202 206.8854 601.9034 18.8579 31.5326 50.0713 30.4867 236.1124 68.7248 34.2069 53.7744 12.5758 55.8823 21.2898 7.2058 12.9512 13.2508 8.2157 2.4584 2.5543 3.1379 5.0783 34.5890 5.1227
temp: 298.150 k
press: 1.00000 atm
elementType: 17 8 8 8 8 7 6 6 6 6 6 6 6 6 6 6 6 6 6 6 6 6 1 1 1 1 1 1 1 1 1 1 1 1 1 1 1 1
symmnumber: 1
zpe: 761941.5 jmol-1
zpe.correction: 0.290208 hartree
zpe.thermalcorrener: 0.311361 hartree
zpe.thermalcorrenthalpy: 0.312305 hartree
zpe.thermalcorrgfe: 0.234540 hartree
zpe.sumelectzpe: -1433.399665 hartree
zpe.sumelectthermal: -1433.378513 hartree
zpe.sumelectthermalent: -1433.377568 hartree
zpe.sumelectthermalfe: -1433.455333 hartree
dipole: 3.6799 0.3683 2.2916
dipole: 4.3508
quadrupole: -128.2726 -130.0797 -125.9530
quadrupole: -16.6588 -0.4906 -3.1098
quadrupole: -0.1709 -1.9780 2.1488 -16.6588 -0.4906 -3.1098
hfenergy: -1433.6898736 hartree
pointgroup: C01 [X(C16H16Cl1N1O4)]
dipole: 1.4732789 -0.5069264 -0.7088461 debye
polarizability: 280.5265083|-20.8379465|168.5935786|4.4570159|8.2348898|181.537037 unknown
InChI: InChI=1S/C16H16ClNO4/c17-13-3-5-14(6-4-13)18-16(20)22-10-9-21-15-7-1-12(11-19)2-8-15/h1-8,18-19H,9-11H2
charge 0 multiplicity 1
38 atoms
Cl -7.595338 2.270075 -1.048368
O  2.20731 -1.547528 0.226133
O  -0.733538 -2.13104 0.316459
O  6.906198 2.839478 0.218206
O  -1.881091 -0.724722 1.825413
N  -2.572578 -1.056625 -0.421899
C  3.293168 -0.669325 0.042795
C  5.536473 0.976528 -0.522345
C  1.367817 -1.350329 1.412617
C  0.26935 -2.405174 1.372287
C  3.643555 0.376275 0.929553
C  4.060286 -0.895447 -1.126897
C  4.763246 1.19086 0.63786
C  5.170604 -0.077253 -1.401095
C  6.740001 1.845381 -0.848067
C  -3.744872 -0.259982 -0.517287
C  -4.405884 -0.213767 -1.77405
C  -4.268149 0.475076 0.579764
C  -1.760091 -1.236464 0.683336
C  -5.575972 0.553598 -1.941514
C  -5.439724 1.243138 0.4111
C  -6.07983 1.274654 -0.841783
H  0.933821 -0.331397 1.42696
H  1.971789 -1.491633 2.334308
H  -0.241884 -2.446704 2.350529
H  0.685726 -3.387794 1.102839
H  3.064731 0.569514 1.837784
H  3.769775 -1.709312 -1.798226
H  5.047011 2.003287 1.311974
H  5.757213 -0.26244 -2.310249
H  6.583023 2.346021 -1.829498
H  7.647488 1.207287 -0.935159
H  -2.273363 -1.562475 -1.258772
H  -4.008332 -0.776751 -2.627221
H  -3.760801 0.443035 1.545863
H  -6.082877 0.587989 -2.90985
H  -5.846397 1.810959 1.252799
H  7.685936 3.413307 0.017799
