program: Gaussian 09
title: 000191190
version: EM64L-G09RevD.01
frameworkgroup: C1[X(C5H8O5)]
method: RPBEPBE
basis: SDD
operation: Freq
keyword: #p
keyword: freq=noraman
keyword: PBEPBE/SDD
title: #p freq=noraman PBEPBE/SDD
converged: YES YES NO NO
title: Mulliken charges:
elementType: O O O O O C C C C C H H H H H H H H
charge: -0.217616 -0.425481 -0.455222 -0.436317 -0.192797 -0.116081 -0.115293 -0.229860 -0.362900 0.175317 0.260155 0.283308 0.278348 0.239783 0.244302 0.350467 0.370573 0.349315
chargesum: 0.00000
title: Mulliken charges with hydrogens summed into heavy atoms:
elementType: O O O O O C C C C C
charge: -0.217616 -0.075015 -0.084649 -0.087003 -0.192797 0.144074 0.168015 0.048488 0.121185 0.175317
polarizability: 8.03513417e+01 -4.69229109e+00 5.98920616e+01 6.42773015e-03 -2.79076909e-01 6.14889149e+01
1716.lowfreq: -12.6150 -2.7482 0.0003 0.0006 0.0009 13.3536 52.7735 81.6211 100.2056
frequency: 52.7284 81.6071 100.1187 187.5678 217.8492 229.7167 246.0590 288.8566 310.7568 342.4177 382.9266 406.1286 468.7843 520.6321 642.1968 665.3228 733.4749 815.5868 832.3659 912.4580 964.4085 973.6150 982.4814 999.6079 1043.9881 1064.9901 1103.3936 1144.5151 1159.2942 1235.2604 1246.0861 1272.1565 1285.0332 1314.1701 1341.0029 1352.6394 1370.9867 1379.8909 1470.6555 1696.9142 3009.9770 3044.2233 3084.5601 3102.7335 3106.7575 3540.7785 3556.6408 3576.5917
redmass: 3.9972 8.5076 5.4610 3.0340 5.0266 3.1671 1.4630 2.8395 1.2408 1.1910 6.8669 5.4081 4.8793 4.4349 7.6509 7.8651 5.3529 2.7365 4.3771 4.9827 2.9842 5.6870 2.4483 4.0926 1.9231 2.7363 3.3826 1.2414 1.1222 1.4756 1.3749 1.3354 1.4907 1.3786 1.2835 1.2751 1.3111 1.2687 1.0767 12.5833 1.0638 1.0865 1.0880 1.0898 1.0998 1.0665 1.0665 1.0669
irintensity: 4.7699 6.9837 5.7059 11.4210 18.4887 2.5570 153.6620 1.4005 73.6382 251.5323 10.3885 1.1379 1.8443 8.5996 20.3462 1.2094 4.5451 28.5347 35.6540 77.4456 149.2607 76.7745 12.3286 37.5670 31.6977 101.7983 66.2444 14.7327 37.8797 5.8011 30.5869 15.3244 8.2882 13.2267 10.9063 6.4306 13.9279 15.9234 9.9135 299.3281 19.3756 17.1439 9.0697 7.0156 16.7811 12.7002 17.4222 11.9839
temp: 298.150 k
press: 1.00000 atm
elementType: 8 8 8 8 8 6 6 6 6 6 1 1 1 1 1 1 1 1
symmnumber: 1
zpe: 352066.4 jmol-1
zpe.correction: 0.134095 hartree
zpe.thermalcorrener: 0.144632 hartree
zpe.thermalcorrenthalpy: 0.145576 hartree
zpe.thermalcorrgfe: 0.097931 hartree
zpe.sumelectzpe: -570.618187 hartree
zpe.sumelectthermal: -570.607650 hartree
zpe.sumelectthermalent: -570.606706 hartree
zpe.sumelectthermalfe: -570.654351 hartree
dipole: 0.0370 0.8850 2.0531
dipole: 2.2360
quadrupole: -68.4325 -63.3182 -55.0135
quadrupole: 3.7148 2.6413 -5.2424
quadrupole: -6.1778 -1.0635 7.2412 3.7148 2.6413 -5.2424
hfenergy: -570.7522819 hartree
pointgroup: C01 [X(C5H8O5)]
dipole: -0.2583183 -0.7213104 0.4323273 debye
dipolederiv: -1.3793956 0.2365305 0.0419241 -0.0863842 -0.447093 0.0935658 0.213657 -0.0118611 -0.3540317 -0.5584538 -0.1386429 0.0172842 -0.1171032 -0.2835597 -0.2436473 0.0310267 -0.2769998 -0.6650646 -0.2630717 -0.1269481 0.0917027 -0.1989742 -0.5419583 0.028509 0.0815675 0.0235406 -0.7286923 -0.6154817 0.2376968 -0.2476906 0.3109727 -0.4351533 -0.0637824 -0.2747246 -0.0711413 -0.5516423 -1.0035848 0.2687688 0.0210906 0.4012838 -0.6723311 0.0596763 0.0481693 0.0382463 -0.3190218 0.2382284 0.020474 0.0645764 0.0935524 0.2322358 0.1506725 -0.0275791 0.2279347 0.5446356 0.4543017 -0.1308147 0.0036646 -0.3556584 0.282991 -0.1065148 0.0326568 -0.0423015 0.1719518 0.1356951 0.1044076 0.0050996 0.081767 0.090551 0.0688673 -0.0170522 0.0705317 0.5117732 0.4741174 -0.1554298 0.1097836 -0.1781525 0.3317262 -0.0878627 0.1940316 -0.0377549 0.3034558 1.81668 -0.4082503 -0.1933433 -0.1130646 0.8016411 -0.1657042 -0.3617255 -0.1116524 0.1959431 0.0640948 0.0682098 -0.0524896 0.0628713 -0.0039897 0.0501672 -0.0450022 0.0417729 -0.0168474 -0.0022048 0.0216358 0.0455233 0.0264139 0.0584803 -0.0037125 0.0616107 -0.0048864 -0.0361923 -0.0447221 -0.0810082 -0.0527202 -0.0586738 0.0314226 -0.0194025 -0.0343403 -0.0206941 -0.022923 -0.0257907 0.0830393 0.0780946 0.0535871 0.0631549 0.0194986 0.0554042 -0.0102216 -0.0417426 0.0184187 -0.0748631 -0.0288638 -0.0356193 -0.0837231 0.0131455 -0.0138443 0.0233057 0.0815457 0.3256434 0.0822183 -0.044 0.0643152 0.1011937 0.1480682 -0.0389289 0.1085513 0.2831668 0.1248989 0.1158846 0.0218174 0.1521266 0.3378188 -0.0450256 -0.0203885 -0.0329569 0.3052088 0.2406269 -0.1229083 0.1185465 -0.1032599 0.1365929 0.1034818 0.1154618 0.0865867 0.3384772 unknown
polarizability: 78.1487299|-7.6982992|62.7739148|0.3311581|-1.4358174|60.8096735 unknown
InChI: InChI=1S/C5H8O5/c6-1-2-3(7)4(8)5(9)10-2/h2-4,6-8H,1H2
charge 0 multiplicity 1
18 atoms
O  0.034551 1.163934 -0.934688
O  -0.036821 -1.868978 -1.85967
O  -1.085841 -0.725247 1.480345
O  2.95043 -0.48989 0.788025
O  -2.219939 1.540419 -0.466886
C  0.152605 -1.217237 -0.561826
C  1.028048 0.058372 -0.66106
C  -1.178515 -0.694569 0.012741
C  1.817449 0.425072 0.612933
C  -1.24339 0.775303 -0.474264
H  0.590276 -1.994847 0.080642
H  1.706012 0.017345 -1.528805
H  -2.04295 -1.273388 -0.358082
H  1.144326 0.436444 1.491554
H  2.261174 1.423992 0.479703
H  -0.281794 -1.195027 -2.545656
H  -1.920399 -0.35731 1.869709
H  2.650275 -1.315591 1.243186
