program: Gaussian 09
title: 000191202
version: EM64L-G09RevD.01
frameworkgroup: C1[X(C10H12N5O7P)]
method: RPBEPBE
basis: SDD
operation: Freq
keyword: #p
keyword: freq=noraman
keyword: PBEPBE/SDD
title: #p freq=noraman PBEPBE/SDD
converged: YES YES NO NO
title: Mulliken charges:
elementType: P O O O O O O O N N N N N C C C C C C C C C C H H H H H H H H H H H H
charge: 1.394659 -0.255277 -0.494558 -0.478678 -0.431517 -0.679663 -0.566238 -0.235110 -0.188833 -0.084889 -0.035920 -0.447657 -0.631351 -0.192151 0.004268 -0.178909 -0.084171 -0.339013 0.168019 -0.208958 -0.107321 0.353630 0.018737 0.282238 0.263179 0.257913 0.317516 0.235163 0.265101 0.375137 0.264052 0.410792 0.333308 0.366198 0.330302
chargesum: 0.00000
title: Mulliken charges with hydrogens summed into heavy atoms:
elementType: P O O O O O O O N N N N N C C C C C C C C C C
charge: 1.394659 -0.255277 -0.494558 -0.478678 -0.056380 -0.268870 -0.566238 -0.235110 -0.188833 -0.084889 -0.035920 -0.114349 0.065149 0.090087 0.267447 0.079004 0.233344 0.161252 0.168019 0.055095 -0.107321 0.353630 0.018737
polarizability: 2.88381027e+02 4.26303582e+00 1.82560791e+02 -6.24488225e+00 -6.02646388e+00 1.14850259e+02
1716.lowfreq: -11.1646 0.0018 0.0018 0.0020 4.3740 5.3639 17.5576 24.8557 41.5019
frequency: 17.1361 24.8140 41.4567 52.0190 75.7002 96.5366 114.9061 122.9293 149.6142 155.3365 181.2041 201.9200 210.2445 226.3448 253.1284 259.4488 275.9759 301.7083 322.8465 329.6261 352.6854 363.0730 383.0227 389.0983 397.2574 416.9021 443.0458 462.9492 468.6563 523.5602 549.3075 567.1972 609.3806 614.1878 622.2400 646.0504 650.2271 661.5959 665.4668 689.0702 707.8482 730.5598 734.2937 760.3570 778.3637 799.1903 814.0940 837.5935 853.9946 879.1007 911.4677 951.6102 967.3387 991.2773 1001.6968 1011.2703 1023.4038 1050.6039 1063.5350 1070.6397 1087.2267 1105.9283 1147.3777 1158.3056 1171.1695 1198.0985 1220.1052 1249.1942 1268.5891 1276.5942 1291.0212 1299.1918 1305.1942 1310.0232 1329.9435 1344.2033 1350.6132 1376.0410 1377.6362 1398.0900 1451.3052 1471.8802 1494.8821 1588.1083 1623.6730 1652.0108 1678.8494 3000.0595 3012.3782 3026.2185 3030.1664 3051.6231 3126.8213 3235.8786 3518.6851 3530.6080 3537.2315 3603.8197 3683.7334
redmass: 8.2085 8.1392 6.7221 2.2474 7.9985 3.5714 8.3921 7.1909 5.7520 6.3821 4.1322 5.2883 4.7600 4.4097 6.1810 3.9029 4.6639 5.3535 3.4713 5.2746 6.3776 4.6414 3.5495 2.6334 1.5122 2.0379 4.4616 8.6408 6.0915 8.8713 9.9806 1.2052 8.6538 6.1515 3.9853 2.5628 2.6428 4.9140 6.2235 9.9422 7.0865 3.2885 6.5674 7.2345 7.1144 1.5724 7.1472 3.0968 4.8695 5.1125 10.1021 2.7672 3.2204 1.3141 7.3077 3.6028 3.4468 4.3927 2.5148 2.1630 3.4047 5.7172 1.3888 2.0905 3.4450 1.3516 1.7316 1.1793 1.3072 3.1241 1.2981 2.0707 1.4171 1.5464 1.7836 1.2873 1.4830 1.5941 5.0373 1.6858 4.8214 1.0923 6.3433 4.9429 1.4921 5.0548 6.2514 1.0828 1.0838 1.0812 1.0703 1.0866 1.1056 1.0981 1.0780 1.0656 1.0461 1.0666 1.1046
irintensity: 0.2518 0.2838 5.7010 69.8329 2.5144 35.1904 3.6465 3.0593 3.5355 19.1569 0.5466 3.5872 11.8705 10.2986 1.7479 2.7459 41.1452 19.9465 12.5901 6.6020 32.9749 12.3454 27.3333 45.0825 94.0880 74.8945 32.6689 1.8215 7.9413 2.5321 2.4824 210.6465 38.4282 8.1381 29.8358 18.0038 68.1914 7.0673 25.7154 107.2820 147.1183 65.5479 170.8578 27.9463 27.4561 9.8753 58.8551 34.6998 105.8909 53.3241 135.1100 20.1413 10.7633 24.8441 175.8095 27.7472 14.7883 1.2720 67.3414 81.7641 108.6527 146.1385 23.7837 1.4844 12.3383 20.6026 20.2508 10.0013 11.8749 112.4833 14.1859 9.6203 32.0718 18.3205 36.5633 0.4080 24.0294 6.6354 123.1876 11.7707 99.7099 8.7939 28.9784 199.3182 125.3502 684.0277 786.0383 5.4423 3.2700 35.3071 57.3040 6.3569 6.9330 0.0359 49.5890 30.1355 134.3668 99.5657 54.9640
temp: 298.150 k
press: 1.00000 atm
elementType: 15 8 8 8 8 8 8 8 7 7 7 7 7 6 6 6 6 6 6 6 6 6 6 1 1 1 1 1 1 1 1 1 1 1 1
symmnumber: 1
zpe: 642446.0 jmol-1
zpe.correction: 0.244695 hartree
zpe.thermalcorrener: 0.265928 hartree
zpe.thermalcorrenthalpy: 0.266872 hartree
zpe.thermalcorrgfe: 0.193200 hartree
zpe.sumelectzpe: -1528.084343 hartree
zpe.sumelectthermal: -1528.063110 hartree
zpe.sumelectthermalent: -1528.062166 hartree
zpe.sumelectthermalfe: -1528.135838 hartree
dipole: -2.8151 9.0712 -1.0273
dipole: 9.5534
quadrupole: -127.2115 -149.7028 -140.0574
quadrupole: -21.8180 4.5754 -1.3496
quadrupole: 11.7790 -10.7122 -1.0668 -21.8180 4.5754 -1.3496
hfenergy: -1528.329038 hartree
pointgroup: C01 [X(C10H12N5O7P1)]
dipole: -1.0583249 3.3997254 -1.2036946 debye
polarizability: 288.2470074|0.3747387|176.1977693|-9.3890151|-20.4435238|121.347301 unknown
InChI: InChI=1S/C10H12N5O7P/c11-7-4-8(14-10(17)13-7)15(2-12-4)9-5(16)6-3(21-9)1-20-23(18,19)22-6/h2-3,5-6,9,13,16,18H,1,11H2
charge 0 multiplicity 1
35 atoms
P  5.038905 0.069527 -0.252552
O  0.881082 -0.029765 1.392287
O  3.62956 -0.696114 -0.964044
O  4.645661 0.195777 1.428846
O  1.405391 -2.356593 -0.884852
O  4.82383 1.695266 -0.809998
O  6.412666 -0.625345 -0.574927
O  -4.947406 -2.255973 0.986977
N  -0.98256 0.237627 -0.081434
N  -2.122491 2.12825 -0.716228
N  -2.855322 -1.232684 0.530557
N  -4.9843 -0.06418 0.185196
N  -5.188562 2.189814 -0.631541
C  2.376679 -0.14384 -0.405212
C  2.291879 -0.33704 1.123202
C  1.140973 -0.923253 -0.889997
C  0.10557 -0.652485 0.254659
C  3.258974 0.589214 1.859327
C  -2.3479 -0.071353 0.089442
C  -0.917746 1.570084 -0.557089
C  -3.023416 1.117474 -0.321225
C  -4.429613 1.112375 -0.266044
C  -4.240034 -1.288104 0.60479
H  2.298737 0.931756 -0.658408
H  2.523656 -1.392984 1.370145
H  0.770135 -0.585061 -1.874924
H  -0.336773 -1.610185 0.582989
H  3.081682 1.653799 1.621356
H  3.269342 0.434812 2.948008
H  2.279249 -2.514408 -1.330947
H  0.027904 2.073866 -0.741846
H  5.613052 2.082776 -1.266454
H  -5.999059 -0.181107 0.266032
H  -4.696618 3.023626 -0.951371
H  -6.204628 2.194932 -0.59152
