program: Gaussian 09
title: 000191193
version: EM64L-G09RevD.01
frameworkgroup: C1[X(C17H26NO)]
method: RPBEPBE
basis: SDD
operation: Freq
keyword: #p
keyword: freq=noraman
keyword: PBEPBE/SDD
title: #p freq=noraman PBEPBE/SDD
converged: NO YES NO NO
title: Mulliken charges:
elementType: O N C C C C C C C C C C C C C C C C C H H H H H H H H H H H H H H H H H H H H H H H H H H
charge: -0.427211 -0.144211 0.003613 -0.278029 -0.362036 -0.386515 -0.469947 -0.491598 -0.457109 -0.439077 -0.615609 -0.408479 -0.415508 0.518627 -0.497218 -0.498300 0.260534 -0.196585 -0.402722 0.240533 0.238269 0.312649 0.273339 0.275320 0.276567 0.213665 0.234301 0.269253 0.266273 0.262743 0.268586 0.244242 0.211013 0.263467 0.273629 0.301336 0.206981 0.238323 0.236005 0.238829 0.252806 0.244182 0.245862 0.245154 0.374055
chargesum: 1.00000
title: Mulliken charges with hydrogens summed into heavy atoms:
elementType: O N C C C C C C C C C C C C C C C C C
charge: -0.053157 -0.144211 0.244146 -0.039759 0.223952 0.165373 -0.021982 0.043928 0.074220 0.016178 0.222822 0.036825 0.059326 0.518627 -0.244413 -0.254118 0.260534 0.049277 -0.157568
polarizability: 1.94024145e+02 -1.80520453e+01 1.81098915e+02 -7.20172651e+00 -4.62952954e+00 1.69632409e+02
1716.lowfreq: -30.7923 -8.4822 -5.5183 0.0004 0.0006 0.0006 34.3442 48.4145 70.5887
frequency: 33.8684 48.3010 69.7813 84.5110 105.9442 129.0382 140.9759 185.0462 213.8155 223.5124 236.9196 271.1040 275.8398 295.2124 304.6898 348.6858 362.8948 394.6201 400.6508 410.5955 430.2301 442.7159 475.5819 477.2515 507.9371 519.3898 615.6927 634.1126 665.9676 677.1496 711.2917 713.7902 722.0956 789.6060 793.2098 799.6272 811.5758 829.1755 845.7826 875.2371 883.5035 887.0587 895.7092 899.8566 903.8636 927.3824 935.1524 949.4136 973.3561 984.2693 987.1504 1002.0951 1007.0223 1042.5634 1064.4087 1077.1849 1078.8044 1090.7166 1094.7955 1109.5612 1125.7614 1142.7399 1156.4624 1164.0046 1171.5299 1186.4330 1214.9811 1222.4167 1228.0981 1237.2608 1238.7896 1254.6159 1258.8615 1270.6360 1287.2960 1299.1073 1308.6089 1309.7212 1315.8306 1324.2816 1328.6526 1342.0648 1351.5144 1354.1991 1357.4694 1369.7413 1377.3255 1401.5827 1434.8929 1459.2991 1466.9177 1467.6770 1472.8859 1474.0156 1476.3759 1478.9654 1480.4778 1489.8721 1493.3157 1494.9795 1505.4731 1587.8327 1623.0690 2971.9122 2972.2214 2982.6839 3003.2500 3005.9432 3010.7384 3026.9402 3035.6761 3044.5981 3055.2421 3056.9561 3057.5874 3065.8331 3067.3981 3081.7860 3088.9563 3107.0627 3116.6658 3133.2280 3134.1782 3139.0175 3147.6265 3149.2666 3163.6699 3185.4995 3584.4983
redmass: 4.4358 4.6671 3.3100 1.9301 3.3911 3.1760 2.3745 3.2589 3.2269 3.7327 4.4401 2.5194 3.0113 1.4577 1.6910 2.0896 2.6606 2.2895 1.1121 3.4836 3.0744 2.6046 2.1251 3.5059 3.6871 7.1169 3.8923 3.0963 3.6749 2.9449 2.2010 2.9923 2.5384 2.0278 1.6908 1.4843 1.7625 1.9528 2.4459 1.7954 2.2006 1.6065 2.6162 2.4685 1.8037 2.5391 2.3281 2.0723 1.3749 3.5143 3.2530 1.8029 2.4048 2.1385 1.8900 1.5023 2.5986 1.7878 1.8864 2.2695 1.1758 1.3814 1.4620 1.5603 1.6578 1.0864 1.3063 1.5813 1.2986 1.2481 1.1765 1.4877 1.3811 1.7482 1.2868 1.4567 1.2817 1.2954 1.2742 1.3163 1.3928 1.3364 1.4505 1.2543 1.3817 1.5363 1.9577 2.2121 1.1513 1.1220 1.3114 1.6345 1.1099 1.1685 1.2084 1.1088 1.4598 1.1334 1.0897 1.0863 1.0881 6.0551 6.1629 1.0708 1.0809 1.0655 1.0822 1.0620 1.0636 1.0333 1.0611 1.0623 1.0954 1.0849 1.0731 1.1013 1.0632 1.0982 1.1033 1.1044 1.0892 1.1064 1.0905 1.1039 1.1081 1.1053 1.0981 1.0907 1.0664
irintensity: 0.1829 0.4044 0.3761 0.2111 1.0037 1.1113 0.1341 2.1180 0.6431 6.1082 3.0585 0.4408 1.1267 2.1230 1.0736 1.1597 0.5743 3.2245 136.4284 10.7493 2.4106 2.0385 1.7363 5.0821 6.0583 1.0184 1.1172 0.9645 2.7188 3.5170 16.8226 9.2792 13.0548 39.8993 21.2454 5.1971 18.9659 5.3895 15.3183 5.6222 40.7519 2.5105 2.5314 10.1726 11.9456 26.1436 8.2853 25.2926 0.1913 8.0358 13.9709 6.9463 5.3535 9.2133 1.0432 0.1937 1.8959 2.3823 5.9501 2.3535 0.7426 153.5947 32.0695 3.0994 12.3821 9.3251 2.1639 1.4624 0.8674 4.9783 2.7701 1.0751 6.4980 11.3199 8.1492 26.1909 10.2143 1.8158 9.2547 9.2011 6.3765 0.8552 1.1028 5.8623 3.9278 4.8145 27.8271 5.4049 21.9379 12.3420 17.2684 18.9357 18.5253 2.9667 3.9498 11.3903 19.7725 31.5447 5.8607 19.9036 17.3054 66.1563 59.2081 9.3940 20.2712 25.2317 31.8173 16.5758 34.8858 14.6674 8.2173 16.5893 22.6492 10.4516 20.4093 20.7159 0.4580 38.4257 0.6197 6.5368 7.7288 6.6168 9.2551 6.4108 6.1787 0.4374 9.1743 2.7864 67.8430
temp: 298.150 k
press: 1.00000 atm
elementType: 8 7 6 6 6 6 6 6 6 6 6 6 6 6 6 6 6 6 6 1 1 1 1 1 1 1 1 1 1 1 1 1 1 1 1 1 1 1 1 1 1 1 1 1 1
symmnumber: 1
zpe: 1053083.2 jmol-1
zpe.correction: 0.401098 hartree
zpe.thermalcorrener: 0.418877 hartree
zpe.thermalcorrenthalpy: 0.419821 hartree
zpe.thermalcorrgfe: 0.356171 hartree
zpe.sumelectzpe: -791.680352 hartree
zpe.sumelectthermal: -791.662573 hartree
zpe.sumelectthermalent: -791.661629 hartree
zpe.sumelectthermalfe: -791.725279 hartree
dipole: -5.5158 -2.2279 1.0614
dipole: 6.0427
quadrupole: -71.9404 -92.4593 -102.2996
quadrupole: -4.5532 -2.5463 1.0749
quadrupole: 16.9593 -3.5595 -13.3998 -4.5532 -2.5463 1.0749
hfenergy: -792.08145 hartree
pointgroup: C01 [X(C17H26N1O1)]
dipole: -1.8008851 1.4533475 -0.5445783 debye
polarizability: 202.505223|11.8580532|171.6679957|6.4398497|-6.1215664|170.5822503 unknown
InChI: InChI=1S/C17H26NO/c1-18(11-4-5-12-18)17-10-3-2-9-16(17)14-7-6-8-15(19)13-14/h6-8,13,16-17,19H,2-5,9-12H2,1H3
charge 1 multiplicity 1
45 atoms
O  3.366623 -0.06566 2.360003
N  -1.730992 0.86452 -0.382874
C  -1.443656 -0.694134 -0.323598
C  -0.124833 -1.12051 -1.049915
C  -0.98686 1.715785 0.671252
C  -3.219456 1.169216 -0.072381
C  -1.587942 -1.277177 1.101077
C  -1.788454 3.030749 0.753865
C  -3.260681 2.650801 0.378898
C  -0.075923 -2.690814 -1.040331
C  -1.431508 1.408405 -1.777079
C  -1.538934 -2.828898 1.034924
C  -0.247103 -3.329137 0.352716
C  1.195787 -0.474094 -0.604669
C  1.711092 -0.53478 0.713627
C  1.979765 0.173598 -1.602426
C  2.962349 0.047592 1.025868
C  3.232084 0.744603 -1.286336
C  3.733398 0.695941 0.031251
H  -2.274658 -1.106533 -0.9353
H  -0.24556 -0.854349 -2.117386
H  0.064782 1.825011 0.372218
H  -1.032227 1.161812 1.620181
H  -3.533464 0.49031 0.733061
H  -3.814585 0.952848 -0.973638
H  -2.545081 -0.976348 1.564814
H  -0.781462 -0.920405 1.762673
H  -1.386451 3.791081 0.064227
H  -1.720355 3.451253 1.769731
H  -3.9368 2.758432 1.242052
H  -3.648895 3.305649 -0.417656
H  0.87886 -3.00398 -1.498924
H  -0.884989 -3.061691 -1.703404
H  -1.933917 0.77494 -2.524591
H  -1.818345 2.435083 -1.850852
H  -0.345939 1.410352 -1.942856
H  -2.422199 -3.200109 0.476459
H  -1.61965 -3.232046 2.060346
H  0.631182 -3.112479 0.988376
H  -0.285813 -4.428453 0.244505
H  1.194325 -1.045031 1.528488
H  1.628063 0.196206 -2.641656
H  3.824938 1.226034 -2.070741
H  4.706417 1.139893 0.273653
H  4.272067 0.305213 2.507643
