program: Gaussian 09
title: 000191315
version: EM64L-G09RevD.01
frameworkgroup: C1[X(C25H20N2O8)]
method: RPBEPBE
basis: SDD
operation: Freq
keyword: #p
keyword: freq=noraman
keyword: PBEPBE/SDD
title: #p freq=noraman PBEPBE/SDD
converged: YES YES NO NO
title: Mulliken charges:
elementType: O O O O O O O O N N C C C C C C C C C C C C C C C C C C C C C C C C C H H H H H H H H H H H H H H H H H H H H
charge: -0.322323 -0.387251 -0.293261 -0.264078 -0.430504 -0.331087 -0.218425 -0.186006 -0.481647 -0.492942 0.386757 0.561261 0.045393 -0.618907 -0.385280 -0.296206 0.051695 0.145384 0.033502 0.131705 0.284183 0.340073 -0.321090 0.133801 -0.294501 -0.323606 -0.317435 -0.247101 -0.244544 -0.214807 -0.215825 0.282781 0.264064 -0.773420 -0.757305 0.298762 0.315585 0.276500 0.425120 0.390453 0.272679 0.283496 0.305012 0.269849 0.236306 0.238743 0.236112 0.237969 0.388085 0.294008 0.244030 0.249440 0.252245 0.253187 0.289369
chargesum: 0.00000
title: Mulliken charges with hydrogens summed into heavy atoms:
elementType: O O O O O O O O N N C C C C C C C C C C C C C C C C C C C C C C C C C
charge: -0.322323 -0.387251 -0.293261 -0.264078 -0.042419 -0.331087 -0.218425 -0.186006 -0.056527 -0.102489 0.386757 0.561261 0.045393 -0.320145 -0.069695 -0.019706 0.051695 0.145384 0.033502 0.131705 0.284183 0.340073 -0.048411 0.133801 -0.011005 -0.018594 -0.047586 -0.010795 -0.005801 0.021305 0.022144 0.282781 0.264064 0.014057 0.037496
polarizability: 5.45232320e+02 1.02292278e+01 3.86384450e+02 1.03857909e+01 1.18437187e+01 1.56719057e+02
1716.lowfreq: -1.8357 -0.0008 -0.0007 -0.0003 2.8728 3.7715 13.3200 16.4989 24.5939
frequency: 13.2488 16.4815 24.5918 32.7408 34.3441 37.3859 49.2273 63.2387 65.2585 76.8488 81.5401 90.6123 101.4179 108.5912 121.8259 132.0774 138.4797 144.0226 147.1414 157.8241 175.5082 184.8934 207.7961 237.6581 244.9436 266.9977 272.9256 283.7945 302.1679 310.0404 327.4594 332.4157 343.5333 360.7284 369.2343 420.3414 428.6160 434.7041 460.2454 489.8385 496.8258 512.5627 514.8837 520.6660 525.1655 534.5621 549.2429 552.5371 570.9250 583.4782 593.1228 633.3518 638.8161 644.4149 663.1785 675.6877 680.9730 687.3198 693.6835 721.2325 731.5399 744.1884 756.9259 760.4697 763.6252 773.4094 781.0938 786.7487 836.4762 840.8504 856.4922 867.4476 870.3674 879.4812 886.1636 892.7699 896.8080 920.0941 967.8680 971.5889 975.6159 980.8233 993.3094 999.6851 1003.3085 1004.0928 1010.4349 1025.2734 1040.0957 1043.0597 1049.9882 1070.6475 1073.4212 1104.0329 1121.7562 1130.6897 1139.0986 1155.0815 1164.9375 1172.4665 1174.9799 1180.0087 1186.8811 1211.7717 1239.5388 1249.7931 1262.1558 1278.0708 1282.3033 1321.3391 1337.2021 1376.6649 1379.0532 1384.2522 1386.4488 1388.4784 1418.2842 1429.8234 1433.3518 1447.5506 1449.8394 1458.4564 1460.5982 1466.1783 1466.8218 1480.0223 1506.0946 1537.6771 1556.8689 1573.4449 1587.4089 1590.7455 1598.9214 1604.2367 1606.4522 1630.2946 1640.1201 1670.7609 1698.7812 3002.7101 3006.4257 3092.2904 3092.5347 3140.2241 3140.6625 3141.8847 3143.7786 3155.8914 3157.1236 3171.0877 3173.9022 3175.2076 3190.5559 3197.6150 3207.0929 3214.4281 3299.4704 3365.2826 3533.3938
redmass: 5.7531 9.3302 6.6109 6.8183 6.1242 7.1625 5.5139 6.4242 5.2542 4.3165 5.0014 4.5662 4.5516 3.7814 2.7582 1.9137 1.3562 4.9415 3.7257 5.6658 5.3733 5.8498 6.4934 6.3855 6.7317 5.9293 7.0240 5.5921 6.5551 5.1711 5.2407 4.6644 7.8498 5.8557 6.2462 8.8439 3.8901 3.5152 3.0079 6.6854 5.5373 4.2992 4.4462 4.7495 4.2041 5.2177 3.3074 3.2757 1.2114 5.9848 6.4207 5.2025 5.9087 6.1923 5.3826 6.0908 4.8157 4.1292 4.9026 5.0503 4.8967 5.8316 2.8832 3.3774 4.2737 4.3939 1.5734 1.7359 1.3821 4.3490 3.1762 1.5060 1.4822 2.9163 1.9525 5.3227 1.4792 1.5691 4.0288 1.3677 1.4215 2.2898 2.1090 1.3298 1.3296 1.3392 5.2287 1.6967 2.7691 2.3342 1.6373 3.5953 3.6386 2.0545 2.1741 2.4048 1.6393 2.4434 2.0864 1.6833 1.6288 1.2137 1.6396 2.1819 2.2625 1.9002 1.7675 1.6588 1.8592 1.9804 3.9512 9.6285 7.7392 1.4996 1.4572 2.4800 4.0369 2.4392 2.3984 1.0618 1.0484 1.1251 1.0704 2.2807 2.3179 3.1660 3.3752 3.6873 4.5050 5.0518 5.5726 7.2311 5.9509 5.4244 5.0166 2.4379 4.0394 9.5039 10.1526 1.0367 1.0388 1.0970 1.0956 1.0869 1.1006 1.0866 1.1011 1.0914 1.0921 1.0983 1.0984 1.0903 1.0916 1.0956 1.0960 1.0943 1.0809 1.0796 1.0642
irintensity: 0.0915 0.7373 0.8837 0.3153 1.9003 4.1197 1.5980 0.8556 0.8991 0.5650 4.2641 3.0363 4.0918 0.0423 3.7996 1.5350 0.7392 3.8815 0.3137 1.0464 4.2853 1.2803 6.0696 4.6580 5.1558 1.2764 1.6953 1.3492 0.3843 1.6974 1.4528 12.1382 11.2580 6.5776 17.6027 23.3406 3.4172 1.3506 31.2375 4.7537 2.9942 6.5690 11.6257 4.6031 12.1919 9.5505 3.4332 1.8350 94.6700 17.8104 5.1992 5.2701 16.9992 5.4466 20.0379 11.8927 41.2277 10.7500 17.6077 0.4035 15.8330 21.6674 26.7278 13.1134 16.9949 33.9103 54.1345 47.7393 35.1807 81.4595 84.2359 80.5248 5.2871 28.8635 24.0011 39.7673 11.3371 78.8976 63.3177 2.4509 10.2665 68.9291 85.0199 3.1706 3.4849 1.4316 331.5567 5.6172 24.5208 36.5772 15.2760 44.7915 38.1251 223.3337 46.8259 218.6445 100.7062 427.0126 19.4882 153.0415 38.6334 1.9040 17.3578 27.1430 51.5132 28.2089 152.1034 149.6127 94.8654 111.7017 355.0464 8.9078 9.8440 14.7248 79.7712 124.3111 208.0845 76.1547 112.0534 33.6310 22.8990 115.2116 23.1424 51.6249 5.8426 188.7577 1188.4651 401.1287 4.1892 177.5163 216.7727 228.5899 26.3984 83.5774 75.0192 100.3175 379.9146 223.9466 178.2386 10.7928 6.8748 8.8764 7.6168 4.1743 6.8992 4.0869 8.7781 4.6285 12.0889 26.9658 18.3455 1.0695 16.6151 3.0578 5.6858 6.0633 155.8810 280.3303 77.2729
temp: 298.150 k
press: 1.00000 atm
elementType: 8 8 8 8 8 8 8 8 7 7 6 6 6 6 6 6 6 6 6 6 6 6 6 6 6 6 6 6 6 6 6 6 6 6 6 1 1 1 1 1 1 1 1 1 1 1 1 1 1 1 1 1 1 1 1
symmnumber: 1
zpe: 1062755.4 jmol-1
zpe.correction: 0.404782 hartree
zpe.thermalcorrener: 0.436750 hartree
zpe.thermalcorrenthalpy: 0.437694 hartree
zpe.thermalcorrgfe: 0.337476 hartree
zpe.sumelectzpe: -1673.573283 hartree
zpe.sumelectthermal: -1673.541315 hartree
zpe.sumelectthermalent: -1673.540371 hartree
zpe.sumelectthermalfe: -1673.640589 hartree
dipole: -0.2246 -0.7401 1.4549
dipole: 1.6477
quadrupole: -192.5521 -187.7597 -203.1489
quadrupole: -8.7020 13.0023 -0.5138
quadrupole: 1.9348 6.7272 -8.6620 -8.7020 13.0023 -0.5138
hfenergy: -1673.9780655 hartree
pointgroup: C01 [X(C25H20N2O8)]
dipole: 0.1222175 0.5631921 0.2968237 debye
polarizability: 544.2515166|-12.2008526|298.7257132|-23.9107439|-111.2404253|245.3585969 unknown
InChI: InChI=1S/C25H20N2O8/c1-14(28)34-21-9-5-3-7-18(21)23(30)26-16-11-12-17(25(32)33)20(13-16)27-24(31)19-8-4-6-10-22(19)35-15(2)29/h3-13,26-27,32H,1-2H3
charge 0 multiplicity 1
55 atoms
O  4.621615 0.245251 0.556085
O  -3.749779 1.626177 -0.469623
O  1.013147 1.263911 -1.17627
O  -4.340815 -2.173497 1.44147
O  2.217545 -4.503529 1.613478
O  3.426089 -2.688304 0.848216
O  6.918113 0.233346 1.116471
O  -4.303457 2.522152 -2.582796
N  2.021876 -0.541479 -0.057145
N  -2.782595 -0.614202 0.641589
C  0.87096 -1.206942 0.428823
C  -1.567663 -1.307925 0.804044
C  0.992791 -2.52633 1.007357
C  -0.411789 -0.623285 0.350856
C  -1.457406 -2.611813 1.367852
C  -0.18475 -3.187868 1.457453
C  3.405838 1.069941 -1.346074
C  2.058787 0.618925 -0.828698
C  -5.188454 -0.076508 0.562264
C  -4.079155 -1.045979 0.919367
C  4.671357 0.895884 -0.711286
C  -5.067737 1.168173 -0.124723
C  3.374485 1.771015 -2.580581
C  2.291615 -3.193401 1.129587
C  -6.492076 -0.475894 0.962231
C  5.861696 1.381562 -1.30347
C  -6.192273 1.978786 -0.388337
C  4.550154 2.254468 -3.184439
C  -7.623557 0.316344 0.698369
C  5.792438 2.051778 -2.543341
C  -7.471085 1.548939 0.022376
C  5.735831 -0.028454 1.403563
C  -3.454817 2.327089 -1.701974
C  5.232827 -0.677862 2.667141
C  -2.005723 2.740073 -1.697751
H  -0.493838 0.370458 -0.08992
H  -2.35154 -3.132038 1.711735
H  -0.07318 -4.186789 1.887042
H  2.919333 -1.006472 0.170698
H  -2.724237 0.329467 0.230447
H  2.39523 1.927864 -3.042581
H  -6.572357 -1.434953 1.483974
H  6.816808 1.238031 -0.799451
H  -6.07186 2.925974 -0.916635
H  4.498345 2.782037 -4.142029
H  -8.614794 -0.019759 1.018345
H  6.717465 2.420687 -2.999343
H  -8.341784 2.179174 -0.186765
H  3.138089 -4.877173 1.655828
H  4.736573 -1.629769 2.409352
H  6.077304 -0.857022 3.347671
H  4.481534 -0.034918 3.157159
H  -1.749806 3.252277 -0.754984
H  -1.818052 3.409573 -2.549589
H  -1.328367 1.87091 -1.78174
