program: Gaussian 09
title: 000017703
version: EM64L-G09RevD.01
frameworkgroup: C1[X(C10H22O)]
method: RPBEPBE
basis: SDD
operation: Freq
keyword: #pfreq=noraman
keyword: PBEPBE/SDD
title: #p freq=noraman PBEPBE/SDD
converged: YES YES NO NO
title: Mulliken charges:
elementType: O C C C C C C C C C C H H H H H H H H H H H H H H H H H H H H H H
charge: -0.438854 -0.017322 -0.411181 -0.393478 -0.395404 -0.367122 -0.747863 -0.389542 -0.353586 -0.329627 -0.697018 0.192220 0.187702 0.206510 0.194789 0.182779 0.203506 0.204772 0.186796 0.198482 0.211478 0.211678 0.213743 0.215740 0.182346 0.192972 0.194928 0.181901 0.214903 0.209542 0.209987 0.215630 0.328592
chargesum: 0.00000
title: Mulliken charges with hydrogens summed into heavy atoms:
elementType: O C C C C C C C C C C
charge: -0.110262 0.174898 -0.016969 -0.015910 0.012874 0.018156 -0.110963 0.008544 0.034314 0.067177 -0.061858
polarizability: 1.26341186e+02 1.68200796e+00 1.13650616e+02 2.36112719e+00 -2.99401329e-01 9.73163850e+01
1716.lowfreq: -17.5284 -0.0006 -0.0003 -0.0002 8.0303 16.1802 28.2365 58.2634 62.3270
frequency: 28.1467 58.0483 62.0090 78.9072 100.6179 107.6953 134.8628 138.9827 164.7070 212.1546 221.4279 237.3053 286.7188 293.7140 314.9687 342.8206 411.7481 426.7503 459.7212 554.6431 725.6714 735.1247 773.5794 793.7152 806.8422 887.0640 892.1891 917.5995 925.8754 953.4211 981.5629 1008.8283 1019.8861 1037.8728 1039.9181 1061.9121 1079.4324 1087.4292 1097.9514 1131.6872 1159.3602 1179.1190 1207.5335 1232.3452 1248.3965 1253.7731 1273.9354 1284.9948 1289.0221 1289.9224 1302.1315 1310.8334 1329.8809 1343.2048 1346.8118 1357.2391 1362.4046 1382.1790 1386.3073 1389.3988 1461.7465 1463.1388 1464.3067 1467.1327 1475.0980 1476.0665 1477.9650 1478.5562 1484.2789 1487.6643 1489.6506 2941.7457 2944.9891 2952.1606 2955.4644 2957.2938 2963.1480 2966.5013 2969.6549 2971.2811 2972.1670 2989.7205 3000.9729 3007.8370 3017.0848 3031.4446 3041.0318 3063.4031 3065.2665 3067.4776 3070.1029 3072.8748 3557.9079
redmass: 4.3537 1.8158 1.5931 2.6100 3.2779 2.8897 2.6636 1.9909 1.9389 2.6269 1.0917 1.1681 2.3923 2.6649 1.2339 3.1246 3.0658 2.6162 2.6930 2.3285 1.0922 1.1018 1.2415 1.2457 2.4034 1.3316 1.6420 1.4408 1.9329 2.8513 1.9223 1.8060 1.4974 2.9162 2.6629 2.4420 2.3976 2.0571 1.2331 1.9246 2.1445 1.8689 1.4914 1.3379 1.3374 1.2684 1.2282 1.1169 1.1493 1.0713 1.2621 1.3092 1.4039 1.4628 1.3934 1.6495 1.4914 1.2463 1.2217 1.2216 1.0744 1.0710 1.0747 1.0719 1.0786 1.0550 1.0635 1.0552 1.0622 1.0806 1.0929 1.0766 1.0695 1.0597 1.0625 1.0604 1.0590 1.0594 1.0455 1.0372 1.0563 1.0970 1.0964 1.1013 1.0983 1.1036 1.1011 1.0991 1.0992 1.1006 1.0993 1.0975 1.0661
irintensity: 0.4995 2.6375 0.8000 3.0691 0.4799 0.8391 0.7785 1.3120 0.3729 1.1195 0.0417 0.1949 9.5118 1.9003 138.3743 10.5419 5.3376 3.7080 0.6613 9.5351 8.9816 9.6353 1.6749 0.3626 1.8598 4.4583 4.2767 21.0442 8.8727 33.9150 32.6448 0.5717 7.7683 7.0514 3.6950 8.7830 0.0916 7.5650 34.1684 0.8281 2.1591 2.3580 1.8050 22.7383 2.5286 2.3989 0.9890 1.3732 1.9587 0.5860 1.0608 0.5168 6.6819 3.9606 2.9272 0.9037 2.6371 22.2845 28.3774 3.9002 0.4030 5.1690 0.8415 1.7783 2.5790 7.4840 7.6061 6.5914 1.5973 32.4978 8.9958 14.9698 59.1004 0.1860 17.6182 2.8202 8.0219 53.2070 49.8969 26.3671 142.7320 6.0253 9.3634 9.1778 10.4692 80.1490 81.9942 53.0549 42.2765 105.6948 55.2850 63.9057 6.3358
temp: 298.150 k
press: 1.00000 atm
elementType: 8 6 6 6 6 6 6 6 6 6 6 1 1 1 1 1 1 1 1 1 1 1 1 1 1 1 1 1 1 1 1 1 1
symmnumber: 1
zpe: 791493.9 jmol-1
zpe.correction: 0.301464 hartree
zpe.thermalcorrener: 0.316520 hartree
zpe.thermalcorrenthalpy: 0.317464 hartree
zpe.thermalcorrgfe: 0.258268 hartree
zpe.sumelectzpe: -468.528677 hartree
zpe.sumelectthermal: -468.513621 hartree
zpe.sumelectthermalent: -468.512677 hartree
zpe.sumelectthermalfe: -468.571874 hartree
dipole: -0.9476 2.0608 0.4008
dipole: 2.3034
quadrupole: -76.4735 -78.0823 -71.8140
quadrupole: 10.1583 2.9090 0.4438
quadrupole: -1.0169 -2.6257 3.6426 10.1583 2.9090 0.4438
hfenergy: -468.8301415 hartree
pointgroup: C01 [X(C10H22O1)]
dipole: -0.4097327 -0.7964676 -0.1377666 debye
polarizability: 126.1357406|-2.3006531|113.8110595|-2.4927368|-0.5424624|97.3613867 unknown
InChI: InChI=1S/C10H22O/c1-3-4-7-10(2)8-5-6-9-11/h10-11H,3-9H2,1-2H3
charge 0 multiplicity 1
33 atoms
O  4.793313 1.439639 -0.016328
C  -0.856071 -1.692674 -0.334502
C  0.425801 -1.000583 -0.884691
C  -1.768821 -0.744875 0.491251
C  1.381974 -0.409329 0.178478
C  -2.298213 0.484141 -0.282785
C  -0.518605 -2.966162 0.479592
C  2.650035 0.208601 -0.456186
C  -3.312073 1.319182 0.532441
C  3.604884 0.811945 0.589084
C  -3.849069 2.542105 -0.242293
H  -1.442236 -2.013976 -1.223743
H  0.986419 -1.742739 -1.491313
H  0.134503 -0.1922 -1.585522
H  -1.228811 -0.405314 1.39935
H  -2.637296 -1.332367 0.856965
H  1.679436 -1.197064 0.89986
H  0.856614 0.371693 0.764404
H  -2.779477 0.144843 -1.224531
H  -1.454295 1.137938 -0.583974
H  -0.002574 -2.718394 1.426198
H  0.136406 -3.648294 -0.094596
H  -1.439092 -3.520562 0.741925
H  2.365052 1.000423 -1.176544
H  3.186164 -0.573103 -1.036886
H  -4.159401 0.669044 0.832745
H  -2.832546 1.656531 1.474222
H  3.903489 0.035854 1.327998
H  3.11405 1.635959 1.134845
H  -4.357303 2.227944 -1.173682
H  -3.026408 3.225982 -0.525155
H  -4.57468 3.118719 0.360516
H  5.27423 0.756493 -0.548841
