program: Gaussian 09
title: 000194764
version: EM64L-G09RevD.01
frameworkgroup: C1[X(C7H13NO4S)]
method: RPBEPBE
basis: SDD
operation: Freq
keyword: #p
keyword: freq=noraman
keyword: PBEPBE/SDD
title: #p freq=noraman PBEPBE/SDD
converged: YES YES NO NO
title: Mulliken charges:
elementType: S O O O O N C C C C C C C H H H H H H H H H H H H H
charge: 0.159144 -0.439670 -0.391886 -0.218990 -0.286132 -0.590934 -0.488167 -0.368610 -0.684856 -0.159229 -0.685641 0.251238 0.261091 0.304819 0.215272 0.222383 0.269355 0.300750 0.262192 0.224025 0.265189 0.208009 0.294293 0.293995 0.400159 0.382200
chargesum: 0.00000
title: Mulliken charges with hydrogens summed into heavy atoms:
elementType: S O O O O N C C C C C C C
charge: 0.159144 -0.039511 -0.009686 -0.218990 -0.286132 -0.002647 -0.183348 0.069045 -0.114750 0.102964 0.011582 0.251238 0.261091
polarizability: 1.36893555e+02 7.45709038e+00 1.05763419e+02 8.89963710e+00 -1.85427035e-01 1.00288177e+02
1716.lowfreq: -11.8598 -9.9513 -0.0001 0.0009 0.0014 9.6423 21.8448 49.1357 52.7925
frequency: 21.2662 49.1098 52.5429 72.0824 98.3539 111.9836 133.5596 171.9597 194.9339 196.6151 216.6959 230.5356 252.3136 267.9604 275.3047 329.2826 355.2207 429.4333 452.3442 473.6568 522.2028 584.5021 609.1195 624.2030 650.1418 681.6823 725.1527 732.3886 751.6519 764.7465 838.2570 906.9505 910.8771 1019.8317 1028.5619 1051.3860 1077.8339 1083.7009 1107.2262 1117.4047 1126.4012 1179.7342 1181.5483 1249.9895 1259.0721 1270.7433 1277.5036 1327.7123 1339.8820 1363.8966 1395.1677 1397.0228 1429.5299 1455.8152 1473.3014 1493.8327 1608.0597 1656.7153 1659.9947 2981.2325 2993.2830 3022.0974 3037.8786 3065.5656 3069.3461 3081.2465 3107.6068 3113.7994 3495.1304 3503.9354 3509.1435 3652.6039
redmass: 6.9973 5.2659 5.1360 5.7213 4.9971 2.5697 3.2970 4.0513 1.6365 2.2374 3.1754 2.8721 3.2906 1.7728 2.5631 4.3375 4.8041 1.6181 3.9625 3.5601 1.6393 2.7851 2.5006 1.3793 4.7531 4.4507 4.5006 4.0843 3.0928 1.9269 2.0852 2.3341 1.7542 4.9493 2.5835 1.4639 2.4942 1.4987 1.7626 1.9921 1.9214 1.3323 1.2365 1.3155 1.4511 1.3696 1.2316 1.7537 1.2302 1.5023 1.2217 1.7606 1.1165 1.0763 1.0413 1.0525 1.2987 3.8678 7.8817 1.0608 1.0375 1.0569 1.0998 1.0862 1.0878 1.0995 1.1078 1.0996 1.0637 1.0638 1.0443 1.1014
irintensity: 4.3321 1.7406 7.6416 1.1961 5.7348 0.6340 42.2522 10.9686 16.0333 11.4958 0.6413 23.6057 8.7266 1.9039 24.6890 1.5537 10.5053 124.5352 51.9874 109.4385 130.2414 15.3179 108.4916 191.1713 33.4149 2.5215 47.3015 29.5191 7.6647 11.1139 3.9911 25.8197 1.9992 92.8917 146.0651 20.6365 157.0273 59.8122 10.9019 8.6867 18.9313 5.8083 7.6626 3.8507 6.7315 6.1733 1.2158 23.4744 4.4247 14.8924 27.3679 8.3123 19.7717 8.7347 15.9053 13.1030 117.5102 140.5066 200.0409 29.5140 25.9108 21.8566 15.4574 10.0915 6.3727 51.4827 2.9363 13.5271 24.7369 55.5326 17.9804 14.3735
temp: 298.150 k
press: 1.00000 atm
elementType: 16 8 8 8 8 7 6 6 6 6 6 6 6 1 1 1 1 1 1 1 1 1 1 1 1 1
symmnumber: 1
zpe: 532049.7 jmol-1
zpe.correction: 0.202647 hartree
zpe.thermalcorrener: 0.218545 hartree
zpe.thermalcorrenthalpy: 0.219489 hartree
zpe.thermalcorrgfe: 0.158304 hartree
zpe.sumelectzpe: -1027.217691 hartree
zpe.sumelectthermal: -1027.201793 hartree
zpe.sumelectthermalent: -1027.200849 hartree
zpe.sumelectthermalfe: -1027.262034 hartree
dipole: -1.3910 -2.1199 -1.7444
dipole: 3.0776
quadrupole: -79.4649 -85.1880 -82.2594
quadrupole: 1.3013 0.8762 4.1964
quadrupole: 2.8392 -2.8839 0.0447 1.3013 0.8762 4.1964
hfenergy: -1027.4203379 hartree
pointgroup: C01 [X(C7H13N1O4S1)]
dipole: 0.4681475 -0.4347128 -1.0285817 debye
dipolederiv: -0.4332001 0.0340471 -0.0074834 0.0260359 -0.015145 0.0375893 -0.0123738 0.039618 -0.2794605 -0.59879 0.2247107 0.1015086 0.2884649 -1.064015 0.0377917 0.0838559 0.1168618 -0.3351818 -0.4556038 -0.1566273 -0.1363443 -0.2590671 -0.913882 -0.3163769 -0.2380648 -0.401166 -0.409501 -0.3887272 0.136014 -0.0058597 0.2363202 -0.5373224 -0.0759069 0.3177626 -0.161161 -0.9090263 -0.4924954 -0.1434336 0.0023833 -0.2164076 -0.7929268 0.0315011 0.081582 0.2703438 -0.6658811 -1.1316453 0.1847989 -0.1424842 0.1463445 -0.3408227 -0.1339798 -0.3198786 -0.1096787 -0.5187032 0.3817579 0.0969022 -0.0299735 0.1707598 -0.0606367 0.0774253 -0.0477474 0.0885367 -0.0903376 0.034563 0.0239159 0.0092491 -0.112942 0.1086874 -0.0167573 0.0784305 -0.0295344 0.0995736 0.2453275 -0.111689 -0.0353047 -0.2696825 0.0190583 0.053267 -0.1309928 0.0260605 0.0876677 0.6674721 -0.1492815 0.0575423 -0.0249253 0.207888 0.0489075 0.1096545 0.0440793 0.16715 0.0394705 0.0078456 -0.0111561 0.0507222 -0.0729423 -0.0495294 -0.0385417 -0.0394109 -0.0103888 0.3441195 -0.5029662 -0.0214553 -0.5696212 1.1043495 0.0139683 -0.3906745 0.0024331 1.1724105 0.4260069 0.322134 -0.0150326 0.4334536 1.3122581 0.2406239 0.1128909 0.0711953 0.957327 -0.0067541 0.0184327 0.0162696 -0.0352362 -0.0557183 -0.0638767 0.0191053 -0.0443924 0.0152831 -0.1114466 -0.0756412 0.0424161 -0.0529208 -0.0439396 0.0184543 0.083304 0.0328044 0.0768333 0.0787578 0.0147219 -0.0274092 0.0547198 0.0361166 0.0192157 -0.0766829 -0.0029218 -0.144995 -0.0390422 0.0485979 0.0600273 0.0524414 0.0608548 -0.0328551 0.0336937 -0.0379523 -0.1096346 0.0108707 0.0196487 -0.0193316 0.0177854 -0.0099502 -0.0134781 -0.0139582 0.0435554 0.1104675 0.0378422 -0.0153532 0.0132397 -0.0473824 -0.050473 0.0356468 0.0153771 0.0448721 0.0510661 -0.0202276 -0.1257035 0.0650359 -0.1151972 0.0280121 0.0180194 0.0722238 0.046599 0.0469075 0.1186251 -0.0266852 -0.0372518 -0.0434467 0.114352 0.033786 -0.0146797 -0.0136719 -0.0732287 -0.1531071 0.1570016 -0.0165224 0.1246424 0.0033147 -0.00748 -0.0332128 0.0101502 0.0993873 0.3653079 0.0237012 0.0297637 0.1047219 0.157685 -0.000974 0.1481302 0.0300131 0.0990533 0.2561845 -0.0932193 0.0967102 -0.0232921 0.1038765 0.0267781 0.1546759 -0.0105708 0.2684505 0.4387431 0.105602 -0.0751827 0.0815703 0.3968927 -0.0752309 -0.0622688 -0.0733183 0.1690641 0.3859905 -0.0174746 0.0866456 -0.0178612 0.3044283 0.0934706 0.0683895 0.0566557 0.1256969 unknown
polarizability: 133.0108619|-12.4699385|105.1397438|-10.3427092|0.1775794|104.7945454 unknown
InChI: InChI=1S/C7H13NO4S/c1-2-5(7(11)12)13-3-4(8)6(9)10/h4-5,9,11H,2-3,8H2,1H3
charge 0 multiplicity 1
26 atoms
S  -0.465666 0.916665 -1.297474
O  -0.922813 -1.881945 0.572651
O  2.277879 1.219629 1.265676
O  -1.787932 -0.107614 1.808325
O  1.59746 -0.989919 1.410769
N  3.274058 -1.017281 -1.048383
C  -1.966393 -0.137553 -0.678445
C  -3.243418 0.724666 -0.745454
C  0.879589 -0.410599 -1.549926
C  2.195745 -0.051527 -0.803599
C  -3.203577 2.06798 0.017086
C  -1.595379 -0.654708 0.700859
C  1.969856 -0.014783 0.713869
H  -2.037808 -0.991976 -1.370823
H  -4.075455 0.105348 -0.353229
H  -3.461173 0.909632 -1.814821
H  1.080933 -0.484912 -2.631592
H  0.476961 -1.365063 -1.17099
H  2.54284 0.947715 -1.113898
H  -2.410141 2.728814 -0.375672
H  -3.0144 1.906713 1.090148
H  -4.169089 2.592764 -0.099314
H  3.815773 -0.897587 -1.903351
H  3.079501 -1.983336 -0.779407
H  -0.40073 -2.071022 1.400686
H  2.118877 1.197797 2.24971
