program: Gaussian 09
title: 000194723
version: EM64L-G09RevD.01
frameworkgroup: C1[X(C10H19FO7P2)]
method: RPBEPBE
basis: SDD
operation: Freq
keyword: #p
keyword: freq=noraman
keyword: PBEPBE/SDD
title: #p freq=noraman PBEPBE/SDD
converged: YES YES NO NO
title: Mulliken charges:
elementType: P P F O O O O O O O C C C C C C C C C C H H H H H H H H H H H H H H H H H H H
charge: 1.426562 1.405713 -0.168743 -0.520749 -0.741548 -0.625668 -0.650424 -0.661520 -0.679682 -0.545458 0.244960 -0.506613 -0.449741 -0.723802 0.412877 -0.334536 0.379823 -0.765585 -0.782621 -0.797648 0.256608 0.234718 0.220289 0.230676 0.258353 0.266456 0.219328 0.240543 0.269871 0.276587 0.217925 0.233908 0.216530 0.221454 0.222855 0.226607 0.411289 0.432286 0.428121
chargesum: 0.00000
title: Mulliken charges with hydrogens summed into heavy atoms:
elementType: P P F O O O O O O O C C C C C C C C C C
charge: 1.426562 1.405713 -0.168743 -0.520749 -0.741548 -0.214379 -0.650424 -0.229234 -0.251561 -0.545458 0.244960 -0.015288 0.001224 0.020335 0.412877 -0.093993 0.379823 -0.219128 -0.114258 -0.126732
polarizability: 2.08602273e+02 6.33497472e+00 1.73736382e+02 -5.34562471e+00 3.78549240e+00 1.64268831e+02
1716.lowfreq: -12.4332 -2.9674 0.0008 0.0012 0.0023 4.4592 20.3297 21.7490 30.0266
frequency: 19.1069 21.4875 29.7009 44.5943 57.4552 67.5402 73.1530 86.2071 108.8835 119.6891 136.7921 147.5900 152.6430 159.0128 183.6217 192.0162 206.8751 211.7891 216.5386 237.6527 246.7170 261.4923 290.4927 296.7841 303.3602 309.3308 318.9671 334.4078 355.3382 368.6473 371.5504 389.1610 403.2694 431.6322 442.3896 444.3524 479.9182 520.8905 534.2347 572.9821 617.9280 643.0801 674.7106 697.0682 736.2547 755.3261 761.2045 772.1080 777.7375 793.9046 814.4821 846.8875 853.1523 900.2163 924.8947 930.3128 947.7491 966.2253 983.1606 994.6000 1002.1862 1031.7396 1036.4640 1042.9446 1079.5022 1082.6515 1107.2420 1133.9759 1152.9425 1168.6751 1202.8563 1213.0484 1231.9778 1244.8740 1280.3414 1297.5654 1346.4101 1357.5729 1386.5880 1388.6022 1392.1462 1399.0223 1452.8861 1455.0770 1459.5400 1467.7754 1470.7976 1473.6919 1481.1327 1486.0181 1644.7776 1696.8676 2959.6645 2965.7376 2984.2921 3002.6721 3009.7785 3030.9597 3034.9784 3037.9934 3065.6904 3076.1035 3082.5711 3088.4000 3092.3137 3112.0290 3120.9038 3129.2720 3236.5667 3342.5515 3586.9064
redmass: 6.9620 3.3704 3.9664 6.5831 9.5375 4.8237 6.3399 4.2309 5.3345 1.0607 3.7340 5.1024 2.0546 5.1389 1.3194 2.5486 2.4195 2.8535 2.5507 3.5477 2.1247 3.9168 5.9208 2.9801 3.0881 4.0341 7.8783 7.1029 6.1299 3.7067 3.7413 2.4830 5.9956 1.3754 4.4237 2.5032 2.7933 3.9458 5.7547 3.5443 4.9330 4.0931 4.3159 3.0045 2.2023 1.2751 2.2238 2.0999 7.9531 6.3834 2.3078 2.1579 2.4212 2.4350 2.0576 1.3227 1.3853 1.6291 8.3358 1.2480 2.0172 2.4307 2.0292 1.3315 1.6312 1.6581 2.0250 2.4175 2.2239 1.8784 2.9177 1.1647 2.2459 2.2084 1.5291 1.1476 1.4014 1.4197 1.1838 1.3039 1.1817 1.2283 1.0598 1.0498 1.0617 1.0640 1.0500 1.0769 1.0557 1.0835 6.2074 6.3973 1.0376 1.0381 1.0599 1.0595 1.0363 1.0970 1.0964 1.0993 1.0994 1.0686 1.0976 1.0950 1.0936 1.0989 1.0630 1.1012 1.1142 1.0678 1.0665
irintensity: 0.9930 0.0377 0.1644 1.5144 0.1441 1.8907 2.1963 1.1758 6.1742 0.1683 10.3177 0.9264 1.9129 4.0095 0.9004 36.5099 11.6578 14.0995 5.6981 5.5538 10.7372 28.0445 12.8016 11.4432 1.4744 8.8712 13.2648 26.6103 72.7995 50.9670 19.5140 0.2976 13.4874 37.4883 41.2081 32.0773 5.9468 20.9781 50.0752 4.9765 10.1271 4.5343 38.6811 156.8680 228.5986 57.5938 60.5181 62.2229 326.4132 189.2685 86.9342 102.1505 131.3807 60.8854 23.4365 133.5211 0.9763 1.0602 125.1644 4.8433 10.4674 14.5397 52.9816 68.2360 12.4190 0.1107 30.2382 52.7658 187.9237 57.7860 33.7506 101.0752 18.5139 21.7005 6.6725 0.6167 3.2860 1.6628 20.0908 26.3718 15.9115 12.0931 11.2137 1.1085 0.7331 6.3775 28.5715 6.3519 15.9821 8.2621 67.4199 5.7515 33.1182 52.7475 6.0392 20.7361 6.7401 5.0611 43.3736 2.9837 29.2022 311.4634 10.2558 31.7371 49.4390 10.4138 3.0411 7.5359 1.4241 334.8917 126.8953
temp: 298.150 k
press: 1.00000 atm
elementType: 15 15 9 8 8 8 8 8 8 8 6 6 6 6 6 6 6 6 6 6 1 1 1 1 1 1 1 1 1 1 1 1 1 1 1 1 1 1 1
symmnumber: 1
zpe: 760624.9 jmol-1
zpe.correction: 0.289707 hartree
zpe.thermalcorrener: 0.315271 hartree
zpe.thermalcorrenthalpy: 0.316215 hartree
zpe.thermalcorrgfe: 0.232897 hartree
zpe.sumelectzpe: -1699.684504 hartree
zpe.sumelectthermal: -1699.658940 hartree
zpe.sumelectthermalent: -1699.657996 hartree
zpe.sumelectthermalfe: -1699.741314 hartree
dipole: 6.2418 3.1393 -0.4262
dipole: 6.9998
quadrupole: -146.7553 -144.7027 -126.9604
quadrupole: -4.5236 -10.1982 -9.2062
quadrupole: -7.2825 -5.2299 12.5124 -4.5236 -10.1982 -9.2062
hfenergy: -1699.9742109 hartree
pointgroup: C01 [X(C10H19F1O7P2)]
dipole: 2.4188811 -1.297694 -0.2216357 debye
polarizability: 208.0966229|-8.8187025|171.0443038|3.3657333|5.7428451|167.4665599 unknown
InChI: InChI=1S/C10H19FO7P2/c1-8(2)6-5-7-10(4,9(3)11)17-20(15,16)18-19(12,13)14/h6,12-13,15H,3,5,7H2,1-2,4H3
charge 0 multiplicity 1
39 atoms
P  -1.29662 0.619184 -1.480671
P  -2.869301 1.491542 1.084345
F  -1.860874 -2.888998 -0.131111
O  -0.515011 -0.884927 -1.604321
O  -2.530017 0.390472 -0.303133
O  -2.025288 0.572429 -3.011229
O  -0.46194 1.9516 -1.149386
O  -3.079039 0.317368 2.280415
O  -1.313011 2.123471 1.39402
O  -4.07949 2.470019 0.86916
C  0.174039 -1.588973 -0.43915
C  1.191874 -0.651021 0.254813
C  2.295049 -0.080762 -0.679135
C  0.828918 -2.781449 -1.165561
C  -0.890076 -2.109132 0.526654
C  3.050313 1.045503 0.000541
C  4.317365 1.015834 0.506016
C  -0.968548 -1.997226 1.873765
C  4.92362 2.249045 1.157479
C  5.233813 -0.195447 0.472433
H  0.657081 0.19118 0.736498
H  1.680292 -1.218732 1.069824
H  2.980159 -0.889188 -0.98904
H  1.821358 0.314038 -1.597814
H  1.502082 -2.41414 -1.955237
H  0.057589 -3.415188 -1.629436
H  1.408866 -3.386221 -0.446335
H  2.482621 1.984525 0.086728
H  -1.721688 -2.568512 2.428499
H  -0.219186 -1.438125 2.437377
H  5.851377 2.557127 0.635503
H  4.225833 3.103783 1.148942
H  5.206139 2.045177 2.209658
H  5.563358 -0.460653 1.496586
H  4.763466 -1.08734 0.026731
H  6.152882 0.027619 -0.104981
H  -2.397929 1.439409 -3.317234
H  -2.475016 -0.477608 2.18342
H  -0.823561 2.395717 0.540661
