program: Gaussian 09
title: 000194634
version: EM64L-G09RevD.01
frameworkgroup: C1[X(C8H7BrN2O3)]
method: RPBEPBE
basis: SDD
operation: Freq
keyword: #p
keyword: freq=noraman
keyword: PBEPBE/SDD
title: #p freq=noraman PBEPBE/SDD
converged: YES YES NO NO
title: Mulliken charges:
elementType: Br O O O N N C C C C C C C C H H H H H H H
charge: 0.036960 -0.178643 -0.188815 -0.262444 0.027950 -0.646482 0.346626 0.242567 -0.485997 0.357067 -0.332177 -0.384096 0.200174 -0.814814 0.330392 0.243767 0.233856 0.290994 0.291118 0.372354 0.319642
chargesum: 0.00000
title: Mulliken charges with hydrogens summed into heavy atoms:
elementType: Br O O O N N C C C C C C C C
charge: 0.036960 -0.178643 -0.188815 -0.262444 0.027950 0.045514 0.346626 0.242567 -0.155605 0.357067 -0.088410 -0.150240 0.200174 -0.232702
polarizability: 2.27354689e+02 -1.35154884e+01 1.44238503e+02 4.00500073e-02 1.35728203e-03 5.06564386e+01
1716.lowfreq: 0.0005 0.0007 0.0008 4.3212 6.4598 12.8976 28.7548 58.3725 75.6300
frequency: 28.6068 58.3693 75.6274 84.1879 117.4837 158.9540 169.5911 208.7569 283.7750 315.0293 359.8589 393.3776 425.2071 450.8168 490.6641 528.4420 533.3362 576.7648 578.3631 658.0852 687.1214 695.9467 724.9125 741.2482 764.4863 779.1470 819.0307 872.8507 885.5436 964.7672 984.1960 1016.6679 1036.9776 1066.4498 1132.0664 1171.7626 1180.0924 1204.1333 1254.6349 1281.4083 1338.9799 1356.9896 1399.1118 1409.1734 1450.6699 1519.3204 1546.3809 1582.3505 1602.8901 1642.9712 3028.8668 3104.3473 3134.6595 3159.8889 3172.0087 3398.0119 3635.2671
redmass: 11.9344 5.3393 4.1425 10.4273 5.2257 5.3531 15.6028 10.5936 5.0829 8.7129 5.2234 6.0957 3.2944 8.6219 2.9548 1.1852 4.7181 7.0499 2.7258 7.4877 5.6823 6.7935 2.9041 8.0773 1.3496 6.2090 1.4674 6.1732 1.8763 1.4199 1.3855 3.3477 1.7916 2.3915 1.1167 4.0071 1.5760 1.7612 1.6745 1.7760 7.1398 2.6019 4.2410 1.1058 5.1582 3.0764 5.4150 1.5823 5.8007 6.8531 1.0566 1.1066 1.0876 1.0963 1.0915 1.0549 1.0955
irintensity: 0.0146 2.7747 1.7547 0.3199 1.3400 0.6743 0.2407 0.8245 0.7746 7.5965 4.2661 1.6581 9.3134 0.1832 10.5402 104.9389 11.4229 39.6341 32.1196 33.4563 0.4220 10.8939 15.6143 4.0936 156.6588 3.6613 36.3525 3.2816 6.2171 0.0120 11.7883 28.1164 13.0976 57.2033 3.4011 364.5463 130.4236 146.7726 61.5096 18.5711 105.6494 52.3005 8.2101 19.5844 4.5087 14.8814 99.6291 21.0925 342.2151 261.3208 25.2857 1.3860 8.5414 10.7799 14.4002 129.4765 73.0064
temp: 298.150 k
press: 1.00000 atm
elementType: 35 8 8 8 7 7 6 6 6 6 6 6 6 6 1 1 1 1 1 1 1
symmnumber: 1
zpe: 378263.0 jmol-1
zpe.correction: 0.144073 hartree
zpe.thermalcorrener: 0.156938 hartree
zpe.thermalcorrenthalpy: 0.157882 hartree
zpe.thermalcorrgfe: 0.102259 hartree
zpe.sumelectzpe: -656.600238 hartree
zpe.sumelectthermal: -656.587374 hartree
zpe.sumelectthermalent: -656.586429 hartree
zpe.sumelectthermalfe: -656.642052 hartree
dipole: -2.2080 8.5231 -0.0009
dipole: 8.8044
quadrupole: -99.7972 -87.1877 -90.7174
quadrupole: -15.2562 0.0002 0.0125
quadrupole: -7.2298 5.3798 1.8500 -15.2562 0.0002 0.0125
hfenergy: -656.7443111 hartree
pointgroup: C01 [X(C8H7Br1N2O3)]
dipole: 0.7626401 3.3789301 -0.0048433 debye
dipolederiv: -0.4494701 -0.0539719 -0.0003221 -0.1311682 -0.0639871 -0.000122 0.000428 -0.0000244 -0.0905583 -0.7325928 -0.0799577 -0.0009668 -0.4952048 -0.7953173 -0.0013484 -0.0007165 -0.0001695 -0.2826519 -0.4002766 -0.0207189 -0.0003665 0.2013501 -0.9709576 0.0023542 -0.0008592 0.0016422 -0.2134786 -1.0212372 0.0427431 -0.0019543 -0.0864425 -0.4155838 0.000164 -0.0016439 0.000495 -0.2736869 1.4779802 -0.4242667 0.0040681 -0.5551448 1.4582626 -0.0044899 0.0043605 -0.004045 0.1982855 -1.313574 -0.6073959 -0.000622 -0.4309295 -0.4890706 -0.0013846 -0.0009271 -0.0018762 -0.6050729 -1.2601551 -0.001831 -0.0031647 0.137508 -0.5167901 0.0009032 -0.0028756 0.0006222 -0.0617169 -0.8132333 0.472002 -0.0030377 -0.0692343 -0.5608478 0.0009384 -0.002088 0.0024999 -0.0178577 0.7111224 -0.3350156 0.002736 -0.1022628 -0.0413437 -0.0002035 0.0014249 -0.0008123 -0.016272 1.2809089 0.7045761 0.0015419 0.2712741 0.4100953 0.0002725 0.0023554 0.0013295 0.1690476 0.2819974 0.2536109 0.0004525 0.1694983 0.4633318 -0.0006908 0.0010969 -0.0002549 -0.0834872 -0.6424154 -0.3792968 -0.000427 0.2240508 0.180418 -0.0002442 -0.0014832 -0.0017741 -0.2002421 1.8360836 0.193572 0.0040602 0.138047 0.8071052 0.0011439 0.0047886 0.0003802 0.1215822 0.3848779 0.2909774 -0.0007588 0.6660051 -0.069962 0.0011803 -0.0029316 0.000663 0.0922796 0.1739737 0.009234 0.0000158 -0.0010351 0.1111509 0.0001245 0.0002073 0.0000973 0.1594799 0.0043161 0.1087437 -0.0006257 0.12316 0.052668 0.0004485 -0.0006634 0.0004108 0.1374268 0.0370519 -0.0729028 -0.0001926 -0.0364131 -0.0842474 0.0004423 -0.0002874 0.0003319 0.1662066 -0.0672779 -0.0860242 -0.0580389 -0.0668667 0.0229592 -0.0762907 -0.044024 -0.0690799 0.029299 -0.0674575 -0.0855509 0.0582171 -0.0665418 0.0240124 0.0759987 0.0445907 0.0688348 0.0287772 0.3304328 -0.0058108 -0.0001103 0.0136618 0.2861797 0.0001881 -0.0001354 0.0001851 0.3738893 0.2489449 0.0772839 -0.0005041 0.0966883 0.1919242 0.0006156 -0.0006171 0.0005444 0.3687508 unknown
polarizability: 226.4204147|16.1059121|145.1716453|0.3642962|-0.1562969|50.657571 unknown
InChI: InChI=1S/C8H7BrN2O3/c9-4-8(12)5-1-2-6(10)7(3-5)11(13)14/h1-3H,4,10H2
charge 0 multiplicity 1
21 atoms
Br -5.316402 -0.300767 -0.010521
O  -2.521042 -1.659374 -0.009275
O  2.238679 -2.427211 0.00854
O  3.770509 -0.74541 0.008396
N  2.530847 -1.173856 0.006439
N  2.979922 1.758731 0.001465
C  -0.980268 0.192077 -0.006161
C  1.446394 -0.186474 0.001279
C  0.126736 -0.680701 -0.001466
C  1.715801 1.23385 -0.000956
C  -0.727906 1.601478 -0.00829
C  0.572719 2.102625 -0.005886
C  -2.35269 -0.41187 -0.008941
C  -3.525196 0.58298 -0.01208
H  -0.042427 -1.761867 0.000051
H  -1.55889 2.314632 -0.012003
H  0.744125 3.185038 -0.007744
H  -3.500201 1.223512 0.885649
H  -3.499412 1.218005 -0.913772
H  3.769201 1.100696 0.005044
H  3.1189 2.767208 -0.000168
