program: Gaussian 09
title: 000017696
version: EM64L-G09RevD.01
frameworkgroup: C1[X(C6H12S3)]
method: RPBEPBE
basis: SDD
operation: Freq
keyword: #pfreq=noraman
keyword: PBEPBE/SDD
title: #p freq=noraman PBEPBE/SDD
converged: YES YES NO NO
title: Mulliken charges:
elementType: S S S C C C C C C H H H H H H H H H H H H
charge: 0.253370 0.258586 0.258586 -0.626052 -0.626051 -0.684109 -0.646544 -0.646544 -0.589891 0.301091 0.301090 0.311304 0.235684 0.235222 0.247418 0.247417 0.235222 0.235684 0.218627 0.239945 0.239945
chargesum: 0.00000
title: Mulliken charges with hydrogens summed into heavy atoms:
elementType: S S S C C C C C C
charge: 0.253370 0.258586 0.258586 -0.324960 -0.324961 -0.372804 0.071780 0.071779 0.108626
polarizability: 1.34324140e+02 2.52644752e-05 1.26261737e+02 6.22414788e-05 -3.17533638e+00 8.19176045e+01
1716.lowfreq: -26.7641 -18.5260 -9.5062 -0.0037 -0.0024 -0.0018 81.9307 88.4702 121.8357
frequency: 81.9307 88.3855 121.7724 203.0249 205.0878 218.5705 227.9785 246.8345 273.4334 278.3804 330.1386 340.3251 359.3201 386.4858 474.8177 554.3761 580.6387 592.0647 611.3755 625.2113 640.6689 974.6089 977.9093 981.7391 1041.6216 1051.8376 1053.0218 1064.4077 1078.8469 1100.9145 1171.5672 1204.4137 1215.3285 1241.8082 1255.6355 1264.2389 1388.6693 1393.2665 1393.3898 1458.1312 1463.1838 1463.6334 1472.1615 1474.0037 1474.4255 2986.1382 2990.1486 2990.3709 3048.1585 3051.6143 3056.9536 3085.7948 3087.8516 3090.1653 3090.2745 3096.8109 3097.1166
redmass: 4.3801 4.0449 3.1682 2.8382 1.2550 1.0655 1.2503 3.4535 3.5326 2.6623 3.2660 9.6747 4.1399 3.9919 5.7104 4.2447 4.8867 6.3265 3.9810 4.7040 4.1909 1.3565 1.5367 1.3676 1.5310 1.3513 2.8988 2.9418 1.6348 3.1696 1.0906 1.1264 1.1464 1.2692 1.2250 1.2791 1.1936 1.1933 1.1952 1.0485 1.0405 1.0396 1.0439 1.0448 1.0444 1.0351 1.0349 1.0348 1.0867 1.0867 1.0868 1.0979 1.1004 1.1000 1.0999 1.0999 1.1001
irintensity: 0.3534 0.2776 1.8493 3.3594 0.7802 0.2203 0.3319 1.8032 0.3284 0.0429 0.1366 0.3094 3.7797 0.2785 5.0873 3.3725 2.5562 1.7322 1.1455 38.2659 36.4271 6.0582 10.5036 16.5952 4.1010 31.7899 9.8829 1.5174 23.7019 1.8198 16.6439 27.2241 4.2894 9.3822 4.3150 3.5367 16.0608 40.3899 17.9538 10.0801 1.7786 35.8924 5.4953 1.7047 9.9571 18.9233 33.1158 10.4871 22.9685 0.7093 0.4393 26.4736 12.0883 8.6881 18.3773 39.9005 2.5326
temp: 298.150 k
press: 1.00000 atm
elementType: 16 16 16 6 6 6 6 6 6 1 1 1 1 1 1 1 1 1 1 1 1
symmnumber: 1
zpe: 441248.5 jmol-1
zpe.correction: 0.168063 hartree
zpe.thermalcorrener: 0.179744 hartree
zpe.thermalcorrenthalpy: 0.180688 hartree
zpe.thermalcorrgfe: 0.130952 hartree
zpe.sumelectzpe: -1429.279190 hartree
zpe.sumelectthermal: -1429.267509 hartree
zpe.sumelectthermalent: -1429.266565 hartree
zpe.sumelectthermalfe: -1429.316300 hartree
dipole: 0.0000 0.4442 2.7576
dipole: 2.7931
quadrupole: -75.5535 -75.9732 -79.5637
quadrupole: 0.0000 0.0000 0.0518
quadrupole: 1.4766 1.0570 -2.5336 0.0000 0.0000 0.0518
hfenergy: -1429.4472529 hartree
pointgroup: C01 [X(C6H12S3)]
dipole: -0.0000189 -0.2139144 -1.0778732 debye
dipolederiv: -0.4499659 0.0000025 0.0000031 0.0000082 -0.4317677 0.1433525 0.0000069 0.056795 -0.1210777 -0.4082265 0.0264258 0.0314629 0.0414196 -0.4239128 -0.0155869 0.012434 0.0269437 -0.1365322 -0.4082187 -0.0264309 -0.0314424 -0.0414203 -0.4239278 -0.0155841 -0.0124182 0.0269525 -0.1365318 0.3492608 -0.2360655 -0.1172496 -0.2695066 0.5422717 -0.1555957 -0.1285175 -0.1740228 0.1578169 0.3492262 0.2360356 0.1172538 0.269483 0.542325 -0.1556034 0.1285205 -0.1740278 0.1578031 0.6405364 0.0000246 -0.0000272 0.0000259 0.2903439 0.2209622 -0.0000286 0.2080067 0.0962803 -0.0942705 -0.0348351 -0.0157847 -0.01113 -0.0386165 -0.0013557 0.0937681 0.0616772 0.0422352 -0.0942824 0.0348312 0.0157914 0.0111187 -0.0386081 -0.0013525 -0.0937666 0.0616672 0.0422396 -0.1266354 -0.0000047 0.0000072 -0.0000095 -0.0586259 -0.1172769 0.0000067 -0.0712273 -0.0941533 -0.0319323 0.02585 -0.048366 0.0403332 -0.0483839 -0.0336172 0.0058475 -0.0105554 -0.1218792 -0.0319228 -0.0258469 0.0483624 -0.0403355 -0.0483901 -0.0336134 -0.0058498 -0.0105547 -0.1218811 0.0235309 0.0000051 -0.0000045 0.0000042 -0.0180924 0.0545378 -0.0000024 0.0254056 0.0092081 -0.0756264 0.0557159 0.0532042 0.1236543 0.047372 -0.047332 0.0304108 -0.0377415 0.094364 0.1005616 0.0109693 -0.0195777 -0.0586083 -0.063024 0.1091195 0.003449 0.1010705 0.0359988 0.1107552 0.0045949 0.0101724 -0.0082914 0.0896439 -0.0337934 -0.0581217 -0.0744436 -0.0790521 0.1107559 -0.0045954 -0.0101776 0.0082931 0.0896431 -0.0337969 0.0581214 -0.0744397 -0.0790539 0.1005572 -0.0109462 0.0195622 0.0586293 -0.063019 0.1091201 -0.0034633 0.1010719 0.0359962 -0.0756109 -0.0557292 -0.0531901 -0.1236696 0.0473519 -0.0473319 -0.0303984 -0.0377423 0.094368 0.0935083 0.0000102 -0.0000122 0.0000132 -0.0318002 0.1539457 -0.0000082 0.0887989 0.007033 -0.0410107 0.1429065 0.0475899 0.099707 0.0196228 -0.0495993 0.0392699 -0.0468189 0.0584064 -0.0409901 -0.1429176 -0.0475773 -0.0997185 0.0195939 -0.0495985 -0.03926 -0.046815 0.0584117 unknown
polarizability: 134.3241397|0.0003029|125.9739668|-0.0012266|-4.7708371|82.2053751 unknown
InChI: InChI=1S/C6H12S3/c1-4-7-5(2)9-6(3)8-4/h4-6H,1-3H3
charge 0 multiplicity 1
21 atoms
S  -0.000079 1.788839 0.156299
S  1.591733 -0.887145 0.779522
S  -1.591581 -0.887301 0.77963
C  1.439994 0.650663 -0.313002
C  -1.440052 0.650526 -0.31292
C  0.0001 -1.820936 0.324162
C  2.74524 1.446364 -0.182844
C  -2.745377 1.446086 -0.182709
C  0.000082 -2.345217 -1.119871
H  1.273802 0.318776 -1.351184
H  -1.273886 0.318628 -1.351103
H  0.000171 -2.660646 1.040078
H  3.60507 0.8255 -0.491581
H  2.709048 2.343693 -0.826062
H  2.907353 1.771786 0.85965
H  -2.907479 1.771501 0.859789
H  -2.709312 2.343415 -0.825935
H  -3.605153 0.825126 -0.491404
H  0.000006 -1.528593 -1.863143
H  0.898713 -2.96243 -1.298018
H  -0.89849 -2.962535 -1.297956
