program: Gaussian 09
title: 000194597
version: EM64L-G09RevD.01
frameworkgroup: C1[X(C14H17N4OS)]
method: RPBEPBE
basis: SDD
operation: Freq
keyword: #p
keyword: freq=noraman
keyword: PBEPBE/SDD
title: #p freq=noraman PBEPBE/SDD
converged: YES YES NO NO
title: Mulliken charges:
elementType: S O N N N N C C C C C C C C C C C C C C H H H H H H H H H H H H H H H H H
charge: 0.412372 -0.473865 -0.116993 -0.233185 -0.181264 -0.008535 -0.565055 0.590598 0.416352 -0.300300 0.163957 -0.497211 -0.371165 -0.775723 -0.463371 0.192975 -0.281907 -0.160052 -0.304093 -0.749855 0.301553 0.264392 0.259557 0.246095 0.376718 0.305766 0.257269 0.255588 0.262356 0.232707 0.209896 0.287657 0.278705 0.253586 0.249055 0.290432 0.374987
chargesum: 1.00000
title: Mulliken charges with hydrogens summed into heavy atoms:
elementType: S O N N N N C C C C C C C C C C C C C C
charge: 0.412372 -0.098878 -0.116993 -0.233185 -0.181264 -0.008535 0.000890 0.590598 0.416352 -0.300300 0.163957 0.008440 0.005554 0.042900 -0.201015 0.192975 0.160696 0.127605 -0.025387 0.043219
polarizability: 2.45436217e+02 1.86269976e-01 2.07108411e+02 -1.45828340e+01 -1.65169459e+01 1.36533201e+02
1716.lowfreq: -9.6159 0.0007 0.0009 0.0011 4.8611 7.7923 19.7604 32.6430 53.1502
frequency: 19.5700 32.6172 53.1031 68.8986 75.6697 120.2481 131.0721 164.5102 171.3373 179.2225 185.6843 191.9695 216.3677 253.2307 260.8222 280.4311 303.0515 319.4148 329.0431 362.2210 401.0345 438.7327 482.5727 506.5813 512.8373 527.2490 559.0089 579.7753 595.9612 600.8883 625.5995 640.2030 647.3810 686.8217 740.9159 756.2320 763.6935 778.9767 820.2800 858.1354 883.1968 891.3230 897.8030 905.8547 924.3390 929.0408 960.0558 963.3902 1025.9801 1030.0836 1046.1868 1047.5198 1050.6005 1069.8127 1080.1507 1127.7986 1138.3715 1160.6495 1190.5881 1193.5617 1201.7296 1224.3381 1245.6721 1260.0376 1274.0252 1280.7742 1317.0476 1330.6708 1341.2636 1346.2216 1367.0630 1373.1595 1402.2931 1402.4863 1413.9175 1432.5902 1445.0109 1449.7316 1453.0005 1454.9593 1463.4588 1472.1324 1480.4604 1491.1732 1508.0097 1525.6673 1596.9722 1601.4434 2965.0449 2987.0228 2992.4375 3013.3598 3030.3508 3034.0378 3040.9458 3062.5188 3074.8754 3076.2902 3124.6352 3132.6895 3144.2017 3146.0400 3239.0911 3271.3228 3587.8500
redmass: 5.3334 5.2181 4.8421 4.4234 4.7385 4.0179 3.8464 1.1277 1.3504 3.7428 2.4318 3.4846 5.1373 3.7496 5.1210 3.0003 1.2901 2.7792 2.2934 2.9518 2.7188 3.2063 4.6767 5.1608 4.5421 5.9328 4.5768 5.3246 3.6349 3.7195 4.8746 5.0921 4.3046 4.6715 2.0686 2.3919 3.3214 5.1672 1.9591 2.9492 1.6322 1.4048 4.7977 1.7061 2.2169 2.1979 2.2016 2.2428 2.5365 3.2493 1.5579 1.6655 1.9246 2.0304 1.9460 4.0665 1.9236 2.2809 1.3528 2.3998 1.2240 1.4643 4.1789 2.7833 1.1940 2.2504 1.9051 1.4975 2.0441 2.3078 2.6057 1.9560 1.3482 1.2688 1.2356 2.4509 1.4087 1.1314 1.0816 2.7788 1.0439 1.1927 1.0861 1.1090 3.8357 4.9843 8.7484 6.9958 1.0566 1.0402 1.0401 1.0704 1.0979 1.1042 1.0650 1.0971 1.0989 1.1017 1.0999 1.0957 1.0970 1.0931 1.0942 1.1064 1.0667
irintensity: 0.0703 0.2751 1.2399 2.5801 0.4835 5.9342 0.4373 3.5773 1.5592 10.3662 6.6043 6.9180 0.4574 3.0546 4.7666 1.2013 123.0671 11.2436 48.1778 4.4213 5.3746 12.5178 0.8191 1.4136 3.3336 1.2693 6.6390 9.1174 2.3423 2.1801 5.0136 2.2296 4.2578 1.0683 49.1552 38.6279 16.4211 5.8552 110.2191 22.1971 12.0556 7.9262 12.8260 15.8906 1.1496 5.3588 13.1839 8.1581 0.8366 51.2470 6.6584 13.5154 15.8482 12.7661 9.9682 25.1680 27.6892 28.4741 6.8185 29.6915 1.5748 9.9305 34.8922 25.5411 18.9220 53.5017 10.0757 10.5798 13.8352 1.4075 1.3827 6.6861 7.5373 32.8666 14.8411 26.0847 25.8458 9.5761 30.5430 20.8171 23.2245 27.8569 14.0593 17.6418 92.8559 14.7469 25.7752 34.1472 52.3872 1.9795 7.4235 3.8606 75.6956 365.1101 8.8046 5.6211 6.1692 4.3499 0.9939 0.7938 0.6774 12.9409 3.9213 2.1225 16.7613
temp: 298.150 k
press: 1.00000 atm
elementType: 16 8 7 7 7 7 6 6 6 6 6 6 6 6 6 6 6 6 6 6 1 1 1 1 1 1 1 1 1 1 1 1 1 1 1 1 1
symmnumber: 1
zpe: 770608.6 jmol-1
zpe.correction: 0.293509 hartree
zpe.thermalcorrener: 0.312468 hartree
zpe.thermalcorrenthalpy: 0.313412 hartree
zpe.thermalcorrgfe: 0.245173 hartree
zpe.sumelectzpe: -1234.276290 hartree
zpe.sumelectthermal: -1234.257331 hartree
zpe.sumelectthermalent: -1234.256387 hartree
zpe.sumelectthermalfe: -1234.324626 hartree
dipole: -3.0338 0.4208 -0.9476
dipole: 3.2061
quadrupole: -50.6514 -111.7098 -106.0389
quadrupole: 6.7643 -2.0954 -0.7419
quadrupole: 38.8153 -22.2431 -16.5722 6.7643 -2.0954 -0.7419
hfenergy: -1234.5697988 hartree
pointgroup: C01 [X(C14H17N4O1S1)]
dipole: 1.2005092 -0.1856796 -0.339696 debye
polarizability: 245.1986404|8.7544286|209.3817133|8.7801782|-13.8752098|134.4974747 unknown
InChI: InChI=1S/C14H17N4OS/c1-10-13(3-6-19)20-9-17(10)8-12-7-16-11(2)18-5-4-15-14(12)18/h4-5,7,9,19H,3,6,8H2,1-2H3
charge 1 multiplicity 1
37 atoms
S  2.809522 -1.872343 0.246073
O  3.734281 1.569867 -2.34084
N  1.214875 0.012571 0.984723
N  -3.125046 -0.705289 -0.198181
N  -1.603504 -1.906887 1.029969
N  -2.995144 1.617897 -0.67395
C  -0.008018 0.681723 1.567372
C  2.335233 0.722051 0.458991
C  -1.235943 0.580976 0.688727
C  3.323936 -0.141327 0.013471
C  -1.905083 -0.67209 0.548878
C  4.656686 0.166602 -0.612726
C  1.300588 -1.333224 0.942702
C  2.362946 2.223259 0.428884
C  -1.823158 1.685012 0.064882
C  -3.63864 0.456007 -0.803999
C  4.582153 0.389588 -2.138906
C  -3.586928 -2.029316 -0.154249
C  -2.64392 -2.736878 0.597533
C  -4.914431 0.347915 -1.583633
H  -0.197322 0.193341 2.539078
H  0.250326 1.73371 1.754476
H  5.075354 1.078702 -0.150675
H  5.373465 -0.650167 -0.412132
H  0.454942 -1.972575 1.241677
H  3.223865 2.560378 -0.165017
H  1.466213 2.629443 -0.071948
H  2.430817 2.655529 1.444488
H  -1.384106 2.685068 0.146386
H  5.609309 0.559094 -2.519111
H  4.154238 -0.501875 -2.642357
H  -4.505804 -2.349749 -0.634329
H  -2.661578 -3.794405 0.850227
H  -5.750608 0.01122 -0.941844
H  -4.820723 -0.377235 -2.413951
H  -5.162141 1.334682 -1.997538
H  3.735145 1.836126 -3.293553
