program: Gaussian 09
title: 000194574
version: EM64L-G09RevD.01
frameworkgroup: C1[X(C11H19NO3)]
method: RPBEPBE
basis: SDD
operation: Freq
keyword: #p
keyword: freq=noraman
keyword: PBEPBE/SDD
title: #p freq=noraman PBEPBE/SDD
converged: YES YES NO NO
title: Mulliken charges:
elementType: O O O N C C C C C C C C C C C H H H H H H H H H H H H H H H H H H H
charge: -0.414142 -0.236250 -0.208962 -0.379219 -0.023862 -0.134253 -0.422280 -0.417350 -0.105038 -0.566675 -0.740284 0.120811 0.225979 -0.480709 -0.676398 0.192433 0.259757 0.212232 0.214405 0.209179 0.223377 0.218733 0.286259 0.231968 0.244147 0.214585 0.214278 0.215931 0.240148 0.212709 0.384050 0.231242 0.240007 0.213194
chargesum: 0.00000
title: Mulliken charges with hydrogens summed into heavy atoms:
elementType: O O O N C C C C C C C C C C C
charge: -0.030091 -0.236250 -0.208962 -0.092960 0.168571 0.125503 0.004356 0.015206 0.113695 -0.090560 -0.095490 0.120811 0.225979 -0.027851 0.008045
polarizability: 1.50892497e+02 4.68624607e+00 1.26670331e+02 -3.90481171e+00 4.86711753e+00 1.14445392e+02
1716.lowfreq: -10.7129 -0.0007 -0.0006 0.0005 2.0301 9.0623 11.3752 28.1353 49.0900
frequency: 4.2232 27.5507 49.0856 54.4217 70.9939 130.0793 148.4737 152.8327 170.3336 205.5727 218.5230 226.0898 258.8135 301.7279 314.3006 352.0063 392.0955 405.8304 440.0366 446.8163 479.6743 509.7257 532.1676 559.3174 577.9711 611.4962 661.7584 689.7594 794.2900 808.0769 826.9907 841.0590 856.1210 910.6931 913.8793 925.6721 944.4254 974.4170 980.8671 1022.8673 1023.7521 1047.9873 1063.7603 1086.1663 1106.5140 1111.3158 1134.8583 1152.7006 1167.3056 1183.2055 1209.3953 1244.3713 1255.6105 1264.7646 1273.2026 1285.2840 1288.8263 1299.8842 1303.6132 1326.2006 1331.5843 1346.1861 1354.3755 1359.0207 1386.9003 1388.0201 1423.0370 1443.1323 1454.2305 1460.9566 1462.9470 1473.7120 1475.5118 1479.5841 1485.9166 1624.5593 1654.3485 2792.9390 2933.9604 2954.4263 2968.8406 2984.7746 2990.2087 2997.3095 2997.5756 3011.8234 3033.3777 3051.0406 3063.3499 3063.7811 3067.4168 3072.1461 3084.8281 3096.4987 3501.8107 3514.1361
redmass: 3.6146 3.8650 8.7955 4.9346 3.1650 2.6268 4.1850 2.8031 3.1412 1.7657 1.1461 1.5857 3.6729 2.4910 2.9507 3.2878 2.9460 2.4739 2.8132 2.8712 1.3415 2.8773 2.6369 3.1721 2.6806 1.5747 3.4409 3.0557 1.3524 2.4534 2.7344 2.2072 2.3289 2.4032 2.2156 1.6682 2.0010 2.1620 2.2535 1.6756 2.2698 1.7082 2.1410 2.2683 1.9568 1.9382 1.6298 1.9005 1.9893 1.5647 1.9130 1.2082 1.2642 1.4045 1.5352 1.4227 1.4220 1.5368 1.4525 1.3980 1.6741 1.7184 1.5169 1.4165 1.1952 1.2151 1.1031 1.2371 1.2067 1.0846 1.0902 1.0472 1.0446 1.0569 1.0652 8.2489 8.9923 1.0763 1.0816 1.0635 1.0356 1.0351 1.0605 1.0600 1.0606 1.0916 1.0873 1.1020 1.1007 1.1001 1.0994 1.1018 1.1004 1.1019 1.0759 1.0640
irintensity: 0.8443 1.6876 0.4367 1.6473 0.2795 0.3239 2.1314 0.4225 8.8787 1.3940 0.1521 1.7740 1.4714 1.8231 1.3022 10.5393 9.0670 17.0078 3.6664 42.0278 57.2374 21.8334 15.5795 28.9048 5.6660 126.2316 25.8690 19.2505 2.0631 0.9593 5.2121 3.1794 4.8040 2.3417 9.9070 7.3263 12.4210 28.2408 14.0697 11.1320 57.9566 0.5312 245.7514 6.8856 14.1212 40.9933 8.6484 4.6942 25.4398 1.0989 7.0665 2.1388 7.2467 4.6663 10.3701 52.1561 3.3350 25.5125 57.4936 1.7678 19.9472 23.4899 6.2697 13.8563 13.7359 8.2135 14.6610 30.8681 3.0466 2.5450 15.6992 17.7914 17.4967 6.5910 19.7578 103.1269 245.2909 65.7269 30.5919 17.0014 34.1680 25.2060 24.7453 24.4037 28.5452 5.2398 25.1632 25.1672 3.4173 20.0580 45.7108 58.2894 52.9785 29.7936 11.8069 28.1561
temp: 298.150 k
press: 1.00000 atm
elementType: 8 8 8 7 6 6 6 6 6 6 6 6 6 6 6 1 1 1 1 1 1 1 1 1 1 1 1 1 1 1 1 1 1 1
symmnumber: 1
zpe: 756063.9 jmol-1
zpe.correction: 0.287970 hartree
zpe.thermalcorrener: 0.304629 hartree
zpe.thermalcorrenthalpy: 0.305573 hartree
zpe.thermalcorrgfe: 0.240548 hartree
zpe.sumelectzpe: -709.800014 hartree
zpe.sumelectthermal: -709.783354 hartree
zpe.sumelectthermalent: -709.782410 hartree
zpe.sumelectthermalfe: -709.847435 hartree
dipole: -0.0089 0.7988 4.0389
dipole: 4.1172
quadrupole: -89.8262 -92.3288 -94.9306
quadrupole: -3.1825 4.4670 -4.7397
quadrupole: 2.5356 0.0330 -2.5687 -3.1825 4.4670 -4.7397
hfenergy: -710.0879835 hartree
pointgroup: C01 [X(C11H19N1O3)]
dipole: -0.0319665 -0.5237913 -1.5324647 debye
polarizability: 151.2430399|-3.5900484|127.5903191|3.4811814|3.251982|113.1748602 unknown
InChI: InChI=1S/C11H19NO3/c1-3-9(13)6-8-4-7(2)5-10(12-8)11(14)15/h7-8,10,12,14H,3-6H2,1-2H3
charge 0 multiplicity 1
34 atoms
O  -4.059324 -0.029032 -1.163336
O  -3.56047 1.894728 0.034077
O  3.211378 0.99303 1.169699
N  -1.039995 0.94691 0.684459
C  -0.330002 -1.818243 0.178217
C  0.37494 0.577305 0.859732
C  0.453899 -0.937926 1.186236
C  -1.791173 -1.316073 0.056388
C  -1.800655 0.191488 -0.311175
C  1.289492 0.96459 -0.345721
C  -0.284452 -3.307068 0.583124
C  -3.197367 0.787527 -0.421052
C  2.786201 0.974849 -0.018041
C  3.754015 0.943704 -1.201563
C  4.102045 -0.526209 -1.572044
H  0.144224 -1.723446 -0.82445
H  0.759354 1.13048 1.736267
H  0.021562 -1.090958 2.194037
H  1.513423 -1.252577 1.233965
H  -2.306586 -1.444935 1.027776
H  -2.341983 -1.892842 -0.708039
H  -1.383261 0.270071 -1.353428
H  -1.269504 1.944681 0.728163
H  1.121285 0.317483 -1.229428
H  1.03454 1.994348 -0.680506
H  -0.743289 -3.455721 1.579324
H  -0.834189 -3.938456 -0.139961
H  0.757156 -3.675417 0.635652
H  4.67722 1.478857 -0.916496
H  3.305119 1.449176 -2.077683
H  -4.942718 0.422864 -1.245217
H  4.800094 -0.550766 -2.427075
H  4.581771 -1.036146 -0.718668
H  3.198952 -1.098273 -1.854734
