program: Gaussian 09
title: 000194642
version: EM64L-G09RevD.01
frameworkgroup: C1[X(C12H22O11)]
method: RPBEPBE
basis: SDD
operation: Freq
keyword: #p
keyword: freq=noraman
keyword: PBEPBE/SDD
title: #p freq=noraman PBEPBE/SDD
converged: YES YES NO NO
title: Mulliken charges:
elementType: O O O O O O O O O O O C C C C C C C C C C C C H H H H H H H H H H H H H H H H H H H H H H
charge: -0.311277 -0.281607 -0.441409 -0.427133 -0.425519 -0.472871 -0.470489 -0.465988 -0.457814 -0.428550 -0.231604 -0.057932 -0.141207 -0.236054 -0.125819 -0.115650 0.001574 -0.044206 -0.321437 -0.174801 -0.235096 -0.314457 -0.054608 0.195912 0.287386 0.309155 0.262676 0.229117 0.232852 0.202730 0.254851 0.240322 0.240203 0.294171 0.358208 0.344904 0.333135 0.168572 0.243292 0.381672 0.218971 0.355864 0.368141 0.357989 0.353831
chargesum: 0.00000
title: Mulliken charges with hydrogens summed into heavy atoms:
elementType: O O O O O O O O O O O C C C C C C C C C C C C
charge: -0.311277 -0.281607 -0.083202 -0.082228 -0.092383 -0.091199 -0.114625 -0.097847 -0.099825 -0.074720 -0.231604 0.137980 0.146179 0.073100 0.136857 0.113468 0.234426 0.158524 0.173736 0.065402 0.059075 0.097406 0.164363
polarizability: 1.86651225e+02 2.05353232e+00 1.61944046e+02 1.45591169e+00 -4.32250442e-01 1.52871981e+02
1716.lowfreq: -11.8391 -7.3185 0.0004 0.0009 0.0010 5.1976 20.2177 23.7716 25.8323
frequency: 19.5117 23.1939 25.7557 46.4449 57.6237 67.9297 86.3531 95.4250 109.2876 118.9976 129.5626 159.5446 165.5796 178.4251 194.9972 211.4212 219.3286 237.8513 259.5399 264.6091 277.1972 295.7626 304.7441 307.8046 338.0927 344.2940 368.9407 381.3811 394.5636 401.3746 404.4678 416.7449 437.1386 454.5297 464.7407 470.4420 484.2390 489.3897 511.4068 535.1758 548.0170 574.7176 586.5543 601.6222 633.8564 699.1900 725.1311 742.6784 790.8212 805.2382 819.9418 867.3291 895.2433 918.1573 932.6670 935.9947 948.1524 954.3623 981.2118 991.7222 1002.2852 1006.0531 1013.8747 1022.9580 1029.6108 1059.9903 1062.2416 1068.1937 1082.7995 1097.4038 1107.0335 1117.1563 1122.7598 1155.2915 1163.4720 1181.1353 1182.2569 1204.5689 1212.7723 1227.7213 1252.7026 1258.1659 1262.9605 1267.4103 1272.3953 1287.4156 1295.0464 1305.9479 1321.6933 1330.0926 1330.5974 1333.2772 1337.6107 1344.2654 1353.1431 1355.0166 1361.4660 1363.6261 1372.7899 1376.0007 1382.7235 1392.1280 1397.6702 1403.4843 1468.9075 1493.5318 1596.2091 2906.9684 2910.5553 2944.2632 2976.3416 2981.8207 2991.9860 2999.0656 3022.2478 3030.3916 3074.5082 3085.6987 3095.5416 3106.9117 3108.8831 3368.0587 3465.0839 3476.0017 3485.2859 3505.0473 3517.7872 3521.0293 3531.5174
redmass: 6.6195 6.7136 7.0516 7.4993 5.5890 5.4340 7.3963 6.7427 4.5098 6.4414 4.2172 5.5003 5.6822 6.1211 3.5851 5.9367 5.0115 5.4121 3.9999 5.2671 4.6279 5.8726 5.5182 5.1823 4.0715 1.2343 3.6366 3.0567 2.7060 1.6218 1.4525 2.6743 3.8262 1.4802 2.2522 1.2653 1.3266 3.9531 2.2103 2.7811 1.1979 3.8056 3.4736 2.6968 1.4232 4.0047 4.0588 3.3505 3.8481 3.7580 3.1955 3.9945 3.7076 4.0222 5.5423 5.9812 3.8734 2.0911 3.7271 3.6915 4.7441 2.1580 4.3037 2.6380 3.2158 3.0789 3.5388 3.6359 3.3106 2.6248 2.3384 2.4450 2.1385 1.1429 1.1699 1.1798 1.1963 1.3786 1.3095 1.2781 1.3037 1.2120 1.2455 1.4718 1.1349 1.2905 1.2735 1.2816 1.2312 1.1752 1.2586 1.3233 1.3491 1.1810 1.2624 1.2118 1.3022 1.4404 1.3040 1.3791 1.4141 1.3841 1.4135 1.2428 1.0828 1.0767 7.8002 1.0708 1.0827 1.0810 1.0841 1.0812 1.0845 1.0661 1.0869 1.0914 1.0901 1.1005 1.0867 1.0871 1.0868 1.0641 1.0659 1.0653 1.0653 1.0651 1.0658 1.0657 1.0654
irintensity: 1.5360 3.0001 0.9242 1.3184 2.0495 3.4726 4.2802 5.5321 3.4736 2.6186 12.0509 10.2791 0.5073 8.8416 13.9649 4.9881 12.4662 10.3779 11.0301 9.2959 5.5105 23.0230 16.7077 15.3899 7.2968 47.2708 1.1614 23.8340 21.1222 19.6276 49.4664 9.2228 4.1882 195.3686 118.3993 171.8002 176.9932 5.3264 44.1992 20.8553 82.5651 13.4433 5.1336 54.6548 161.8142 5.8781 58.5160 25.6566 9.5497 17.3308 47.8292 102.1985 45.2758 49.3282 3.4714 165.4431 53.9456 81.9740 42.3035 222.8290 32.6985 74.1272 50.7053 81.7367 33.7203 29.0787 22.8395 92.5214 14.2676 15.9191 15.4457 31.3227 71.9510 56.5361 26.0379 25.3913 11.3052 56.9728 18.7549 29.2982 40.3483 30.8198 15.5540 29.4977 5.9880 2.6983 32.7991 9.9242 49.3852 27.6088 10.7420 20.4406 10.3039 16.6765 20.9925 10.2102 7.7080 4.8200 29.7100 3.7985 34.9650 44.3309 22.3451 19.5669 2.8545 8.0280 141.8938 76.9524 48.8201 25.9673 47.3487 2.6560 32.1893 9.4477 20.5976 38.7507 13.3376 14.6193 5.4842 6.5874 3.3667 51.8416 19.4501 47.5062 11.5990 15.6271 7.5293 7.0762 12.3132
temp: 298.150 k
press: 1.00000 atm
elementType: 8 8 8 8 8 8 8 8 8 8 8 6 6 6 6 6 6 6 6 6 6 6 6 1 1 1 1 1 1 1 1 1 1 1 1 1 1 1 1 1 1 1 1 1 1
symmnumber: 1
zpe: 929781.2 jmol-1
zpe.correction: 0.354135 hartree
zpe.thermalcorrener: 0.379445 hartree
zpe.thermalcorrenthalpy: 0.380389 hartree
zpe.thermalcorrgfe: 0.298197 hartree
zpe.sumelectzpe: -1295.968200 hartree
zpe.sumelectthermal: -1295.942890 hartree
zpe.sumelectthermalent: -1295.941946 hartree
zpe.sumelectthermalfe: -1296.024138 hartree
dipole: -4.5816 -3.2223 -0.0457
dipole: 5.6015
quadrupole: -149.6632 -145.7314 -148.8126
quadrupole: 8.9112 2.8114 1.3987
quadrupole: -1.5941 2.3376 -0.7435 8.9112 2.8114 1.3987
hfenergy: -1296.3223347 hartree
pointgroup: C01 [X(C12H22O11)]
dipole: 1.9088868 -1.0613273 -0.2940622 debye
polarizability: 186.7605812|0.6329799|161.545393|-1.9014889|1.5174134|153.1612777 unknown
InChI: InChI=1S/C12H22O11/c13-1-4(16)7(18)11(5(17)2-14)23-12-10(21)9(20)8(19)6(3-15)22-12/h2,4-13,15-21H,1,3H2
charge 0 multiplicity 1
45 atoms
O  1.377567 -1.123147 -1.290024
O  0.308696 0.939381 -0.497381
O  3.747997 2.08269 0.073309
O  2.994794 0.69411 -3.002345
O  3.87008 -0.485885 1.533611
O  -1.222433 -0.257954 1.659743
O  0.582561 -3.261821 0.1970
O  -3.215352 1.991734 -0.3066
O  -3.067137 -2.242357 1.061049
O  -4.714338 -2.14997 -1.223558
O  -2.536446 2.610714 2.204705
C  3.409136 0.796983 -0.530958
C  2.423199 1.068664 -1.70239
C  2.833461 -0.156344 0.534932
C  1.090551 0.310407 -1.536028
C  2.239262 -1.434959 -0.088619
C  -1.158088 0.712338 -0.550909
C  -1.525627 -0.547019 0.248743
C  1.368928 -2.230668 0.903454
C  -1.793793 2.01442 -0.015364
C  -2.971037 -1.068022 0.134916
C  -3.410606 -1.495211 -1.274811
C  -1.56377 2.262494 1.482989
H  4.319009 0.321554 -0.9699
H  2.244853 2.151946 -1.763321
H  2.066694 0.375871 1.119193
H  0.539244 0.288109 -2.49604
H  3.044798 -2.081614 -0.495811
H  -1.469201 0.589822 -1.609409
H  -0.859573 -1.362498 -0.100747
H  0.696569 -1.537618 1.444173
H  2.006161 -2.75773 1.632225
H  -1.299054 2.853943 -0.553407
H  -3.692942 -0.349464 0.550689
H  4.24698 1.903476 0.913454
H  3.011857 -0.297794 -3.060948
H  4.607464 -0.9829 1.089515
H  -2.643766 -2.168734 -1.726486
H  -3.540055 -0.610247 -1.919548
H  -1.801287 -0.851535 2.212915
H  -0.519342 2.226997 1.84801
H  0.453419 -2.928837 -0.732431
H  -3.673227 2.331815 0.518662
H  -2.356803 -2.901604 0.822423
H  -4.723202 -2.717539 -0.406481
