program: Gaussian 09
title: 000194569
version: EM64L-G09RevD.01
frameworkgroup: C1[X(C19H29NO2)]
method: RPBEPBE
basis: SDD
operation: Freq
keyword: #p
keyword: freq=noraman
keyword: PBEPBE/SDD
title: #p freq=noraman PBEPBE/SDD
converged: NO YES NO NO
title: Mulliken charges:
elementType: O O N C C C C C C C C C C C C C C C C C C C H H H H H H H H H H H H H H H H H H H H H H H H H H H H H
charge: -0.471655 -0.438139 -0.070601 -0.054414 0.177527 -0.491605 -0.476586 -0.509310 -0.096121 -0.419422 -0.426122 -0.353038 0.328384 -0.437326 -0.414527 -0.447972 -0.447451 -0.394214 -0.382378 -0.263650 -0.236771 -0.244678 0.188141 0.206412 0.243780 0.224474 0.211627 0.206670 0.222436 0.217788 0.199727 0.204385 0.222226 0.183762 0.213880 0.225090 0.210206 0.227422 0.204173 0.222922 0.230110 0.214740 0.217150 0.226565 0.333997 0.320946 0.230063 0.284199 0.224757 0.225214 0.227209
chargesum: 0.00000
title: Mulliken charges with hydrogens summed into heavy atoms:
elementType: O O N C C C C C C C C C C C C C C C C C C C
charge: -0.137658 -0.117193 -0.070601 0.133727 0.177527 -0.041413 -0.040485 -0.080204 0.121667 -0.015309 -0.020135 0.085931 0.328384 0.000301 0.012567 -0.003123 -0.003735 -0.164151 -0.098180 -0.038893 -0.011558 -0.017469
polarizability: 2.13699098e+02 -3.15702618e-03 2.19219257e+02 7.56467932e+00 1.29260510e+00 1.90972994e+02
1716.lowfreq: -11.9323 -0.0005 -0.0001 0.0005 4.1321 7.2771 23.9764 36.2362 40.0727
frequency: 23.4925 35.7181 40.0174 44.6473 45.6404 52.0923 81.0012 84.9886 129.2681 144.8920 160.8050 184.7179 205.9718 232.3153 238.9816 263.1633 267.3914 290.9012 307.9741 324.9659 336.1470 371.2053 393.8770 401.3038 409.7220 410.5763 444.1231 470.4686 477.5719 498.3467 512.9528 578.0829 617.7698 625.6845 633.7432 658.4714 710.8195 715.0987 760.6343 779.1940 785.5754 792.6536 828.6320 842.0096 850.9170 863.4619 869.6134 876.2254 889.2578 897.2216 907.8813 924.0683 929.4252 932.7423 944.6265 980.6627 984.3040 990.6502 1000.5212 1010.9778 1023.7310 1029.2219 1032.5830 1047.2380 1050.8411 1060.9049 1066.4773 1068.9831 1077.8668 1101.9701 1107.5003 1118.1336 1124.9510 1147.2021 1157.5671 1170.6733 1171.7161 1172.5607 1181.3120 1192.6758 1214.9793 1218.0298 1219.6228 1247.2041 1248.2340 1260.8374 1271.8271 1280.7855 1286.7615 1292.2774 1298.0715 1301.8321 1315.2775 1316.3739 1316.7007 1320.0658 1332.7603 1340.2733 1343.2081 1348.9391 1370.1666 1372.0398 1376.6516 1382.1556 1432.9676 1456.9098 1459.7148 1461.7214 1465.2001 1468.7202 1469.8317 1473.0598 1477.5918 1480.9068 1483.8729 1487.9395 1588.0590 1612.5361 2902.3509 2904.2395 2956.4682 2968.2374 2968.9046 2979.1530 2981.6994 2981.8829 2991.0543 3002.8240 3016.0351 3018.0501 3032.6203 3035.9654 3043.2317 3049.6220 3051.8996 3058.0234 3063.4418 3067.7536 3074.4530 3088.3289 3119.9173 3129.2071 3142.2237 3158.2849 3180.7682 3542.4687 3552.8153
redmass: 3.5357 3.7330 3.9594 1.7177 3.7029 4.2386 3.6331 3.5512 3.1260 2.7976 2.7869 3.9126 3.6010 3.2903 3.3639 2.4818 2.2322 1.3336 1.2711 2.3942 2.8805 3.6892 2.6038 3.3313 3.0190 2.9474 1.9406 2.4204 3.2880 3.3104 3.2705 3.1788 6.3910 2.6590 3.1185 2.6971 2.0971 2.6371 1.7071 2.0264 1.6894 1.6465 1.8504 1.9923 1.8649 1.2662 2.1033 3.5458 1.9313 2.3153 2.4832 1.7555 1.8264 1.6814 2.3252 3.1200 1.4302 6.1896 1.3354 2.6589 2.6381 2.6944 2.8713 2.1266 1.6126 1.6146 1.9769 1.5061 1.7164 2.5830 2.3739 2.0448 2.2885 2.1224 2.3135 1.2942 1.1524 1.1725 1.2614 1.1404 1.4062 1.2009 1.3492 1.3584 1.3557 1.3011 1.4135 1.3301 1.3231 1.3484 1.2364 1.1981 1.3969 1.3745 1.2843 1.3992 1.3734 1.4888 1.4647 1.4613 1.4012 1.2379 4.0054 1.8497 2.2156 1.0900 1.0853 1.0818 1.0914 1.0854 1.0827 1.0901 1.0945 1.1694 1.9750 1.0958 6.1197 6.0674 1.0818 1.0693 1.0665 1.0651 1.0626 1.0607 1.0638 1.0644 1.0647 1.0591 1.0841 1.0639 1.0961 1.0931 1.0990 1.0987 1.1003 1.0971 1.0977 1.0999 1.1008 1.1057 1.0844 1.0882 1.0939 1.0991 1.0949 1.0658 1.0656
irintensity: 0.2621 0.1992 0.7657 0.0195 0.0773 0.0608 0.7084 0.8518 2.3278 0.4467 3.7583 6.7088 3.6766 1.3686 1.5165 6.0366 7.4996 105.7010 57.2432 122.8378 7.6432 15.2206 4.4134 2.9984 2.6173 2.6440 2.8228 3.1523 3.9820 4.1789 1.6782 19.4839 0.0919 0.1794 5.4344 31.8402 51.6411 23.0856 26.3554 23.3586 2.5900 0.2792 8.5409 14.4662 5.6752 0.1620 14.8625 12.2127 6.3135 13.5024 10.5847 20.5071 9.4360 6.4325 10.7492 41.5873 3.3098 0.3912 4.6951 61.9364 14.4950 3.6479 4.4213 4.7035 1.0771 8.1518 18.8443 22.5356 19.8082 7.0407 10.2675 24.2645 2.0990 24.7703 13.8567 20.4075 7.1458 12.7896 2.7561 2.0025 3.5956 1.5280 2.1831 4.7970 6.5216 11.0615 27.4748 5.6147 5.2203 4.3014 0.9187 0.9828 0.3527 2.1361 6.2156 15.3068 0.1711 2.5071 10.7729 5.4555 11.6302 35.6053 5.4751 21.4031 13.6556 5.8183 1.9092 0.5261 6.8804 13.3262 13.2539 12.2426 10.4085 8.7364 8.7425 9.2512 0.7837 5.0832 29.1696 55.5255 18.9321 22.6305 39.8299 30.7642 43.1519 30.8198 53.1207 37.6767 23.1776 50.3946 28.7301 29.2033 40.7382 61.5864 12.0644 31.3651 37.9591 0.4083 31.7577 118.2856 2.2272 6.2363 40.9288 25.3321 4.9625 6.3841 4.9730
temp: 298.150 k
press: 1.00000 atm
elementType: 8 8 7 6 6 6 6 6 6 6 6 6 6 6 6 6 6 6 6 6 6 6 1 1 1 1 1 1 1 1 1 1 1 1 1 1 1 1 1 1 1 1 1 1 1 1 1 1 1 1 1
symmnumber: 1
zpe: 1168310.7 jmol-1
zpe.correction: 0.444986 hartree
zpe.thermalcorrener: 0.466960 hartree
zpe.thermalcorrenthalpy: 0.467904 hartree
zpe.thermalcorrgfe: 0.392503 hartree
zpe.sumelectzpe: -944.882779 hartree
zpe.sumelectthermal: -944.860805 hartree
zpe.sumelectthermalent: -944.859861 hartree
zpe.sumelectthermalfe: -944.935262 hartree
dipole: 1.8463 0.1364 2.2476
dipole: 2.9119
quadrupole: -145.5422 -129.0756 -132.0620
quadrupole: -2.8645 -6.8479 1.6898
quadrupole: -9.9822 6.4843 3.4979 -2.8645 -6.8479 1.6898
hfenergy: -945.3277647 hartree
pointgroup: C01 [X(C19H29N1O2)]
dipole: -0.7380494 -0.015211 0.8760675 debye
polarizability: 213.9328995|-0.6454669|218.8655131|-7.1367606|-3.4823389|191.0929363 unknown
InChI: InChI=1S/C19H29NO2/c21-18-10-6-9-17(15-18)19(22,16-7-2-1-3-8-16)11-14-20-12-4-5-13-20/h1-3,7-8,17-18,21-22H,4-6,9-15H2
charge 0 multiplicity 1
51 atoms
O  0.28109 0.201334 -2.093254
O  5.353519 0.518285 -0.992636
N  -3.441545 1.464218 -0.378625
C  1.609381 1.103886 -0.215986
C  0.28543 0.336178 -0.607895
C  2.880037 0.364405 -0.711395
C  1.761123 1.448647 1.28914
C  -0.969953 1.156969 -0.199059
C  4.151669 1.201534 -0.46929
C  3.039975 2.283892 1.544462
C  4.307232 1.566532 1.020442
C  -2.297417 0.568018 -0.718344
C  0.256251 -1.100341 -0.064401
C  -4.662674 1.210485 -1.19678
C  -3.938797 1.287821 1.019415
C  -5.419004 0.020551 -0.513299
C  -4.989442 0.116966 0.988154
C  -0.081784 -1.361236 1.289476
C  0.587895 -2.196801 -0.900265
C  -0.080842 -2.679472 1.796818
C  0.585256 -3.516504 -0.39541
C  0.254607 -3.765633 0.956286
H  1.550682 2.076297 -0.762202
H  2.975055 -0.599291 -0.167921
H  2.794192 0.127312 -1.786543
H  1.819324 0.509263 1.874046
H  0.881979 2.011616 1.654826
H  -1.017385 1.254795 0.901022
H  -0.872575 2.1886 -0.5948
H  4.111026 2.12748 -1.074007
H  2.941598 3.267616 1.039935
H  3.143333 2.492699 2.62645
H  5.204843 2.198066 1.154563
H  4.470182 0.633969 1.602678
H  -2.425544 -0.467452 -0.324626
H  -2.240805 0.485701 -1.81823
H  -5.295949 2.119011 -1.168515
H  -4.394076 1.016854 -2.248978
H  -3.101975 1.095734 1.712533
H  -4.431045 2.22582 1.340028
H  -5.097408 -0.942025 -0.949558
H  -6.512721 0.098263 -0.644248
H  -5.846184 0.335725 1.6499
H  -4.539909 -0.831389 1.331746
H  0.32948 1.115694 -2.473428
H  5.438809 -0.353455 -0.52699
H  -0.361126 -0.537847 1.956035
H  0.828458 -2.000701 -1.948047
H  -0.347257 -2.857633 2.845013
H  0.839374 -4.350431 -1.059882
H  0.252214 -4.789325 1.347446
