program: Gaussian 09
title: 000194530
version: EM64L-G09RevD.01
frameworkgroup: C1[X(C6H6ClN7O)]
method: RPBEPBE
basis: SDD
operation: Freq
keyword: #p
keyword: freq=noraman
keyword: PBEPBE/SDD
title: #p freq=noraman PBEPBE/SDD
converged: YES YES NO NO
title: Mulliken charges:
elementType: Cl O N N N N N N N C C C C C C H H H H H H
charge: -0.056956 -0.178463 0.152393 -0.069387 -0.277939 -0.635417 -0.072646 -0.610396 -0.609284 -0.039509 0.125978 0.227191 0.285896 -0.388787 0.090498 0.320553 0.393593 0.335497 0.334101 0.333808 0.339275
chargesum: 0.00000
title: Mulliken charges with hydrogens summed into heavy atoms:
elementType: Cl O N N N N N N N C C C C C C
charge: -0.056956 -0.178463 0.152393 -0.069387 -0.277939 0.078729 -0.072646 0.059202 0.063798 -0.039509 0.125978 0.227191 0.285896 -0.388787 0.090498
polarizability: 2.62203952e+02 -8.77118815e-01 1.37013374e+02 3.31521503e-03 -5.72050517e-03 5.03995700e+01
1716.lowfreq: -4.0067 -3.1009 -0.0019 -0.0017 0.0002 5.0858 55.7751 61.9793 103.6478
frequency: 55.7689 61.9770 103.6474 115.4083 191.2871 214.4381 253.8163 279.4192 292.2482 305.8184 344.0950 352.6033 360.9241 393.6294 430.4667 441.6516 471.5607 525.0742 537.2372 560.5579 568.6243 586.9947 632.4684 662.2204 684.6584 700.2794 721.1875 723.0983 759.7604 812.9486 817.7215 913.5911 961.7209 990.4565 1011.9747 1029.5608 1055.9933 1168.0135 1243.7332 1287.5956 1353.0574 1375.0272 1445.1078 1462.7626 1496.6338 1540.0918 1550.7695 1566.0414 1600.3856 1621.2206 1629.3171 3303.4243 3531.8662 3582.5312 3629.4990 3685.9397 3730.5960
redmass: 7.9518 5.6878 7.7804 7.7317 6.7928 7.1962 7.9838 5.3893 4.4549 6.0645 4.3284 1.3318 5.4922 3.9720 1.2743 4.1921 3.7789 1.1707 1.1581 3.5844 1.3880 10.4067 9.5289 8.5208 10.6350 7.9322 8.9224 8.3108 5.3853 1.2406 11.4739 11.7576 3.5062 4.1329 4.1246 2.1798 2.8958 2.3293 5.2361 8.9241 5.2075 5.5798 5.6181 4.9814 3.2732 2.9872 3.1575 3.7645 1.5461 1.7799 1.8571 1.0622 1.0446 1.0449 1.0908 1.1054 1.1055
irintensity: 0.4515 7.0209 0.8232 0.0927 2.0378 1.6980 1.3195 4.3463 2.6548 10.6045 13.1487 137.1663 11.8929 36.6317 152.1966 1.0260 39.6877 147.6135 1.1614 3.6281 283.2293 4.5758 10.8220 26.6775 1.3636 6.2971 0.5476 16.7955 0.1492 147.6189 2.6064 11.7240 13.1074 25.7015 147.2523 2.2627 56.5765 0.0942 7.1003 22.5319 153.1954 17.0604 53.0887 102.6154 280.0659 395.6226 43.6534 152.1227 282.3590 601.3914 276.6834 167.1976 178.4846 127.7999 83.5929 54.0637 53.0211
temp: 298.150 k
press: 1.00000 atm
elementType: 17 8 7 7 7 7 7 7 7 6 6 6 6 6 6 1 1 1 1 1 1
symmnumber: 1
zpe: 369218.4 jmol-1
zpe.correction: 0.140628 hartree
zpe.thermalcorrener: 0.153812 hartree
zpe.thermalcorrenthalpy: 0.154756 hartree
zpe.thermalcorrgfe: 0.100757 hartree
zpe.sumelectzpe: -1149.695105 hartree
zpe.sumelectthermal: -1149.681921 hartree
zpe.sumelectthermalent: -1149.680977 hartree
zpe.sumelectthermalfe: -1149.734976 hartree
dipole: 0.2490 6.5619 0.0052
dipole: 6.5666
quadrupole: -55.1950 -95.0585 -95.9076
quadrupole: 3.8640 0.0364 0.0114
quadrupole: 26.8588 -13.0048 -13.8539 3.8640 0.0364 0.0114
hfenergy: -1149.8357333 hartree
pointgroup: C01 [X(C6H6Cl1N7O1)]
dipole: -0.2168554 2.5736745 -0.0600334 debye
dipolederiv: -0.5739339 -0.3910401 0.0162207 -0.5660098 -0.6663185 0.0220039 0.0206195 0.0197914 -0.088798 -0.3058132 -0.1295924 0.006139 0.4335465 -0.5029862 0.0053276 -0.0066512 0.009567 -0.0866868 0.4981544 -0.1529955 -0.0038387 0.5741807 -0.1594598 -0.0061503 -0.0223116 0.0032595 -0.1097431 -0.8357869 -0.2444671 0.0133552 -0.3059137 -0.5214717 0.0096672 0.0146278 0.0087309 -0.2995931 -1.4320785 -0.1421618 0.0192182 -0.2847518 -0.3950349 0.0072152 0.0245876 0.0061579 -0.2423513 -0.5213296 -0.5301721 0.01201 -0.3365254 -1.077388 0.01523 0.0070918 0.0180131 -0.639606 -0.4832315 0.1918319 -0.000302 -0.572305 -0.2696946 0.0083385 0.0185186 0.0007833 -0.2067452 -1.888653 0.1618327 0.0115442 0.3529 -0.2259639 -0.0160087 0.0069743 -0.0135894 -0.6816434 -1.3755702 -0.4527969 0.0202539 -0.6162624 -0.3908153 0.0023775 0.0252483 0.0001384 -0.730945 -0.7942809 0.3564556 0.0009943 -0.5560912 -0.4532144 0.0180169 0.0231508 0.0065426 -0.020139 0.6439288 0.4944029 -0.0182385 0.3582527 1.2555244 -0.0308225 -0.0145621 -0.0329822 0.2240366 1.5556523 -0.0861688 -0.0166454 -0.0733979 0.5327566 -0.0081099 -0.0179166 -0.0075332 0.1502712 1.9345815 -0.2039188 -0.0162919 -0.8998267 0.3858457 0.0090135 0.0012228 0.000106 0.2849401 -0.1060175 0.6883686 -0.0167037 1.5645394 0.7287453 -0.0397594 -0.0386709 -0.0284552 -0.0402704 1.9954006 0.4598396 -0.0363382 0.9894134 0.4867464 -0.0213597 -0.0495087 -0.0142351 0.1985866 0.1512773 0.0374506 0.0018567 0.0248804 0.2491565 0.0028414 0.002242 0.0027734 0.3697625 0.4077124 -0.0652903 0.0008676 -0.0993545 0.2782829 0.003161 0.0019064 0.0027155 0.347264 0.3479781 -0.0087311 0.0006386 0.0576439 0.2020304 0.0036567 -0.0010495 0.0045143 0.3780317 0.2565801 -0.0336641 0.0024671 -0.125612 0.1734011 0.0068478 0.004727 0.0056663 0.380228 0.2212352 0.0416947 0.0017605 0.1011905 0.2146191 0.0025321 -0.0010266 0.0022594 0.4070915 0.3041945 0.0091224 0.0010323 -0.020497 0.1552388 0.0059811 0.0007801 0.005776 0.4063093 unknown
polarizability: 260.5266338|14.1949269|138.589555|-3.0881763|-2.4139011|50.5007072 unknown
InChI: InChI=1S/C6H6ClN7O/c7-2-4(9)12-3(8)1(11-2)5-13-6(10)14-15-5/h8-10H2
charge 0 multiplicity 1
21 atoms
Cl -3.433424 -2.392905 0.113912
O  1.815221 -1.549087 0.021974
N  -1.005355 -1.130821 0.050462
N  -2.079375 1.474436 -0.001459
N  2.220079 0.694177 -0.037058
N  0.076998 2.392215 -0.053014
N  3.295188 -1.38023 0.00227
N  -4.248274 0.578741 0.049311
N  4.639418 0.614999 -0.067788
C  -0.159084 -0.053977 0.012416
C  -0.720356 1.28561 -0.014051
C  1.270105 -0.264849 -0.000974
C  -2.893226 0.384611 0.036418
C  -2.30309 -0.934288 0.06218
C  3.425099 -0.021723 -0.035548
H  -0.363157 3.310066 -0.071253
H  1.100286 2.248892 -0.062512
H  -4.880383 -0.219132 0.077576
H  -4.606363 1.531581 0.02999
H  4.671248 1.628875 -0.088278
H  5.498546 0.073907 -0.066476
