program: Gaussian 09
title: 000194502
version: EM64L-G09RevD.01
frameworkgroup: C1[X(C5H11NO3S)]
method: RPBEPBE
basis: SDD
operation: Freq
keyword: #p
keyword: freq=noraman
keyword: PBEPBE/SDD
title: #p freq=noraman PBEPBE/SDD
converged: YES YES NO NO
title: Mulliken charges:
elementType: S O O O N C C C C C H H H H H H H H H H H
charge: 0.972584 -0.255454 -0.564616 -0.556352 -0.342474 -0.607218 -0.216587 -0.757684 0.207463 -0.760558 0.245782 0.295734 0.279312 0.246739 0.296400 0.262700 0.261378 0.236342 0.269528 0.242693 0.244288
chargesum: 0.00000
title: Mulliken charges with hydrogens summed into heavy atoms:
elementType: S O O O N C C C C C
charge: 0.972584 -0.255454 -0.564616 -0.556352 -0.098186 -0.065702 0.309463 0.062794 0.207463 -0.011996
polarizability: 1.21974572e+02 -1.68174170e+00 9.39077538e+01 6.15161550e+00 -3.56695653e+00 8.04235881e+01
1716.lowfreq: -83.8629 -3.6642 -3.5026 -0.0006 0.0011 0.0013 12.1310 31.2419 35.3882
frequency: -83.8255 31.1328 35.3314 47.2821 150.6714 158.7478 167.6881 186.1111 220.6062 235.9711 281.2806 317.2256 324.8533 394.7532 446.3926 487.5696 555.4407 571.7843 585.5024 774.5556 790.9023 815.2400 880.8830 907.4625 921.8668 947.9912 973.7368 997.6245 1020.1177 1021.6837 1047.4503 1080.2803 1154.6046 1200.1152 1240.5571 1294.7031 1300.7570 1364.2109 1391.8893 1400.8239 1408.8493 1426.1009 1441.6860 1458.4744 1471.9328 1628.4552 2998.1839 3000.9160 3026.7490 3047.6634 3059.8442 3088.9226 3126.6993 3148.1604 3176.0731 3178.7053 3399.4367
redmass: 1.0548 4.8105 5.0750 4.1865 2.6586 3.6086 1.6559 2.7340 3.1260 3.2693 2.9263 6.6321 5.0836 2.7698 3.9315 3.9295 3.5386 5.7148 3.7871 2.5130 8.3714 1.1425 3.3770 2.5287 1.7503 1.8930 1.4357 1.9686 1.2907 2.3273 1.5341 2.5998 1.2595 1.2534 1.1994 2.2560 1.1424 1.4564 1.2386 1.1560 1.0555 1.0562 1.0716 1.0929 1.0449 6.7653 1.0573 1.0369 1.0250 1.0636 1.0973 1.0983 1.0999 1.1097 1.1072 1.1072 1.0771
irintensity: 0.6993 4.2810 5.4201 2.0683 2.4788 4.2269 3.5947 6.2394 5.8669 4.5144 18.7001 38.8505 18.0892 2.8641 6.7515 13.4832 4.3995 27.8461 36.9569 12.3398 45.4884 62.0430 26.4954 8.1212 15.4408 6.0213 26.1646 136.3778 152.2271 56.8135 9.1800 49.3170 0.8385 1.9094 17.8677 149.7471 5.1508 5.8712 56.3606 8.9621 11.9089 10.5477 29.3271 24.7804 17.5696 172.6146 10.2324 10.1480 1.6255 7.2875 6.5119 11.4729 7.0091 1.7451 1.6347 1.2878 7.6814
temp: 298.150 k
press: 1.00000 atm
elementType: 16 8 8 8 7 6 6 6 6 6 1 1 1 1 1 1 1 1 1 1 1
symmnumber: 1
zpe: 423553.7 jmol-1
zpe.correction: 0.161323 hartree
zpe.thermalcorrener: 0.173599 hartree
zpe.thermalcorrenthalpy: 0.174544 hartree
zpe.thermalcorrgfe: 0.121389 hartree
zpe.sumelectzpe: -874.612993 hartree
zpe.sumelectthermal: -874.600717 hartree
zpe.sumelectthermalent: -874.599772 hartree
zpe.sumelectthermalfe: -874.652927 hartree
dipole: -0.3141 -3.0991 -2.7590
dipole: 4.1612
quadrupole: -47.0295 -72.8491 -72.3442
quadrupole: 13.4375 4.0463 4.2929
quadrupole: 17.0448 -8.7748 -8.2700 13.4375 4.0463 4.2929
hfenergy: -874.774316 hartree
pointgroup: C01 [X(C5H11N1O3S1)]
dipole: 0.1351676 -1.2230033 1.0798974 debye
dipolederiv: 1.5066872 0.0050281 0.0209649 0.0154837 1.2299454 -0.002759 -0.0000436 0.0024942 1.1837582 -1.3884344 0.0202649 -0.3681392 0.2321345 -0.4474065 0.018635 -0.4208324 -0.0730614 -0.4408454 -0.6669146 -0.0164471 0.0154829 -0.0933391 -0.5083741 -0.0727194 -0.0336768 0.0367972 -0.6926168 -0.6132659 -0.0607648 -0.018636 -0.0425129 -0.7035823 -0.0083873 0.0414897 -0.1232563 -0.5192865 -0.5380892 -0.0809756 -0.006184 -0.5204803 -0.7946682 -0.2972685 -0.1850006 -0.1400941 -0.5342679 0.0431168 0.0819793 -0.050054 0.0993063 0.0155278 -0.0087873 -0.0542715 0.0310624 -0.1302562 0.5513206 -0.1078253 0.0433952 -0.4800826 0.1868369 -0.0955347 0.1530433 0.0201264 0.1679895 -0.3025569 0.0372669 -0.0139114 0.0693889 -0.1506367 0.0174048 -0.0212586 0.0319893 -0.0961164 1.4137265 -0.0121244 0.4690233 0.2334046 0.8107719 0.2940793 0.6848821 0.2085543 0.4279433 -0.1396405 0.1488007 -0.051184 0.1459868 -0.2319556 -0.0339235 -0.0611594 -0.0330999 0.0555522 -0.0877867 0.0394281 -0.0021315 0.0516509 -0.0369065 0.0533719 0.0258029 0.0363453 0.0738224 0.0656023 -0.0225098 0.0365178 -0.0894139 0.0227665 -0.0206853 0.0272183 -0.0074353 -0.0079121 0.0666807 0.0472294 0.0053829 0.1466772 0.0761737 0.0222263 -0.008444 -0.0568234 0.0101139 -0.0473218 -0.0830082 0.045564 0.0840812 -0.0196616 0.0821832 -0.0162308 0.0476454 0.0770924 0.0226131 -0.0360836 0.0295692 -0.0221836 0.0618056 0.0448244 0.0296773 0.0438485 0.0806423 0.0216879 0.0271175 -0.0308623 0.0404029 0.1008254 -0.0042832 -0.0283169 -0.0020778 -0.0482672 0.0201746 0.0251654 -0.0136832 0.0259331 -0.0399336 -0.045272 -0.0271444 -0.0463557 0.0897394 -0.0600183 0.0059218 0.0918533 -0.0374721 0.0682887 0.0316876 0.0979973 -0.0045092 0.0616396 0.0739753 -0.0899008 -0.0529918 -0.0551689 0.0039384 -0.0558952 -0.0418461 -0.0674272 0.0920168 0.0942389 0.0229377 -0.0385949 0.0279971 0.0696916 0.0045049 -0.0627315 0.0595599 -0.0710624 -0.0357956 0.0484996 -0.1113811 0.1682064 0.286553 0.0765979 -0.0991543 0.0357175 0.2203208 unknown
polarizability: 120.8604949|3.0367108|94.1106625|8.2684973|4.2781776|81.3347564 unknown
InChI: InChI=1S/C5H11NO3S/c1-5(6)9-3-4-10(2,7)8/h6H,3-4H2,1-2H3
charge 0 multiplicity 1
21 atoms
S  1.944803 0.516783 0.073275
O  -1.231955 0.115073 0.54461
O  1.557328 0.209497 -1.488668
O  1.848443 2.018441 0.707533
N  -2.839595 -1.121684 -0.603568
C  0.90342 -0.734726 1.193698
C  -0.377249 -1.085314 0.470576
C  3.757461 -0.071077 0.312267
C  -2.475503 0.016354 -0.085515
C  -3.207399 1.343617 -0.030704
H  1.560017 -1.610585 1.324035
H  0.756652 -0.17486 2.129394
H  -0.197816 -1.342118 -0.590655
H  -0.887182 -1.941903 0.951784
H  4.356253 0.639537 -0.274058
H  3.986392 -0.007246 1.385458
H  3.826604 -1.092174 -0.087825
H  -4.141593 1.245241 0.55057
H  -2.57572 2.115367 0.434098
H  -3.474276 1.671317 -1.050736
H  -3.774084 -1.086042 -1.048168
