program: Gaussian 09
title: 000194520
version: EM64L-G09RevD.01
frameworkgroup: C1[X(C7H18O6P2)]
method: RPBEPBE
basis: SDD
operation: Freq
keyword: #p
keyword: freq=noraman
keyword: PBEPBE/SDD
title: #p freq=noraman PBEPBE/SDD
converged: YES YES NO NO
title: Mulliken charges:
elementType: P P O O O O O O C C C C C C C H H H H H H H H H H H H H H H H H H
charge: 1.333390 1.286373 -0.533808 -0.620260 -0.613635 -0.677368 -0.671092 -0.611846 -1.015846 0.044112 0.042151 -0.660795 -0.659695 -0.695218 -0.649712 0.347032 0.330103 0.219370 0.251176 0.208656 0.243059 0.230359 0.208053 0.237854 0.226753 0.215767 0.287826 0.208778 0.218886 0.223306 0.216613 0.401826 0.427829
chargesum: 0.00000
title: Mulliken charges with hydrogens summed into heavy atoms:
elementType: P P O O O O O O C C C C C C C
charge: 1.333390 1.286373 -0.533808 -0.620260 -0.613635 -0.275542 -0.243264 -0.611846 -0.338712 0.263482 0.293327 0.021280 0.012966 0.017154 0.009093
polarizability: 1.64029058e+02 2.86774468e+00 1.48625968e+02 4.63514310e-01 1.54435300e+00 1.21673850e+02
1716.lowfreq: -12.8648 -1.8409 0.0005 0.0012 0.0017 7.5536 15.2856 25.1162 35.0186
frequency: 6.1534 24.8828 34.6841 50.9233 71.2956 77.9019 114.1828 118.2887 153.1178 156.6082 179.6768 185.6400 193.1495 211.5181 215.8817 220.5343 233.4098 257.2211 265.1869 305.5967 325.6808 339.8628 340.2000 349.0424 365.3984 389.1037 403.2801 420.5961 448.9218 479.6770 607.1236 636.8992 662.8273 667.8682 698.7031 741.8802 759.4668 807.9260 816.8426 844.2118 900.2803 911.0358 924.5553 929.3831 935.9251 936.2324 1005.6274 1025.8212 1056.1475 1093.0418 1101.0859 1143.0041 1150.0175 1153.2471 1159.0436 1181.4073 1182.6642 1211.7021 1319.8421 1328.3450 1339.3605 1349.2462 1377.2946 1378.9452 1381.3315 1394.2290 1401.5767 1453.2987 1459.4747 1461.0102 1466.9932 1468.4827 1474.0390 1485.3356 1492.3809 2981.2027 2985.5336 2988.6233 2989.6855 2993.4828 3018.0226 3061.0231 3078.6348 3085.3912 3085.9855 3091.3845 3093.2095 3094.7748 3102.0045 3107.0992 3148.7595 3294.3161 3604.7538
redmass: 2.8321 4.0695 2.9604 4.2237 4.8599 5.2751 4.6426 5.0120 5.9184 4.1612 3.0927 1.0445 3.6827 1.0585 2.2531 2.2473 1.5501 1.6614 1.3517 5.5497 3.6498 2.9180 4.5004 3.9310 3.8841 3.8485 3.9172 2.6688 4.1836 4.2310 4.8396 5.1294 4.3824 1.1819 6.7832 5.0616 6.3683 4.0786 2.2471 4.7290 2.7934 3.0280 1.2605 1.2708 1.3462 1.2985 2.1260 2.3459 3.7987 1.6284 1.6903 1.2266 1.2544 2.0508 1.9281 1.9751 1.9079 1.2474 1.2785 1.3392 1.3545 1.2691 1.0719 1.2529 1.2507 1.2207 1.2130 1.0501 1.0518 1.0465 1.0489 1.0472 1.0498 1.0488 1.0495 1.0356 1.0364 1.0722 1.0458 1.0386 1.0873 1.0561 1.0991 1.0989 1.0991 1.1009 1.0988 1.1011 1.1010 1.1008 1.1063 1.0648 1.0662
irintensity: 0.3412 0.2009 0.2514 0.6938 3.6158 1.5828 1.1848 5.6284 4.7922 3.3653 41.2330 0.1542 20.9557 3.2291 46.1367 2.3289 0.5826 8.9941 2.7502 16.8158 3.5147 29.9087 54.8509 47.6429 23.2334 14.0071 18.1023 6.9654 22.8174 19.1612 6.2751 1.9178 54.5805 65.5769 96.0804 230.2683 93.6650 267.7225 64.7224 194.7916 74.4476 113.1629 9.0130 2.9939 1.1452 0.1777 22.3514 59.1345 227.9344 51.2547 122.6220 13.7539 87.3801 9.4550 17.7526 19.1291 25.6436 55.1457 14.6144 7.8476 6.9154 11.1677 14.0373 29.9559 25.7630 25.8822 28.0145 5.0807 7.4600 2.9965 10.8633 1.3830 8.7065 19.6796 12.8850 16.8010 20.4442 11.6745 12.7447 20.4700 2.2237 2.8888 4.4526 50.2450 4.1469 11.9819 49.2399 25.6296 13.5264 29.6642 5.0385 256.4775 73.1359
temp: 298.150 k
press: 1.00000 atm
elementType: 15 15 8 8 8 8 8 8 6 6 6 6 6 6 6 1 1 1 1 1 1 1 1 1 1 1 1 1 1 1 1 1 1
symmnumber: 1
zpe: 675989.7 jmol-1
zpe.correction: 0.257471 hartree
zpe.thermalcorrener: 0.278325 hartree
zpe.thermalcorrenthalpy: 0.279269 hartree
zpe.thermalcorrgfe: 0.205590 hartree
zpe.sumelectzpe: -1410.093610 hartree
zpe.sumelectthermal: -1410.072756 hartree
zpe.sumelectthermalent: -1410.071812 hartree
zpe.sumelectthermalfe: -1410.145491 hartree
dipole: -3.2908 0.4019 -1.8573
dipole: 3.8001
quadrupole: -100.4884 -98.4252 -117.6324
quadrupole: -4.4894 1.4066 -4.1979
quadrupole: 5.0269 7.0901 -12.1171 -4.4894 1.4066 -4.1979
hfenergy: -1410.3510809 hartree
pointgroup: C01 [X(C7H18O6P2)]
dipole: -0.6837062 1.2497875 -0.4536238 debye
polarizability: 157.0096095|-7.9740733|153.8969245|-1.741974|7.70674|123.4223418 unknown
InChI: InChI=1S/C7H18O6P2/c1-6(2)12-15(11,13-7(3)4)5-14(8,9)10/h6-9H,5H2,1-4H3
charge 0 multiplicity 1
33 atoms
P  -0.417773 -0.433508 0.96594
P  0.875385 -2.82021 -0.607167
O  -1.867962 0.098969 0.207808
O  0.877162 0.155269 -0.074979
O  -0.201093 -0.03109 2.491636
O  0.131031 -4.227721 -1.2607
O  0.842966 -1.763416 -1.966948
O  2.288051 -3.026786 0.098303
C  -0.526752 -2.243478 0.494756
C  -2.356619 1.515434 0.404998
C  2.036871 0.91867 0.54084
C  -2.081409 2.28933 -0.890203
C  -3.842474 1.398679 0.755996
C  3.307191 0.351702 -0.100116
C  1.81253 2.41364 0.291741
H  -1.470484 -2.39139 -0.051867
H  -0.519934 -2.84294 1.418122
H  -1.798534 1.954899 1.256974
H  2.016088 0.701885 1.626095
H  -2.433655 3.332899 -0.791239
H  -1.003145 2.301876 -1.121908
H  -2.614119 1.819686 -1.735225
H  -4.280618 2.405195 0.88672
H  -3.981245 0.830142 1.690666
H  -4.386617 0.883925 -0.055092
H  4.19395 0.82655 0.358719
H  3.371402 -0.739212 0.055807
H  3.3322 0.561346 -1.185187
H  2.658429 2.992479 0.706114
H  0.887012 2.76415 0.781932
H  1.747808 2.622524 -0.791006
H  0.742495 -4.824805 -1.761216
H  1.008759 -0.820592 -1.648713
