program: Gaussian 09
title: 000194471
version: EM64L-G09RevD.01
frameworkgroup: C1[X(C6H11NO2S)]
method: RPBEPBE
basis: SDD
operation: Freq
keyword: #p
keyword: freq=noraman
keyword: PBEPBE/SDD
title: #p freq=noraman PBEPBE/SDD
converged: YES YES NO NO
title: Mulliken charges:
elementType: S O O N C C C C C C H H H H H H H H H H H
charge: 0.172320 -0.388500 -0.307224 -0.379519 -0.112419 -0.420980 -0.324716 -0.686150 0.292324 -0.769956 0.283081 0.212666 0.240861 0.250112 0.261226 0.255548 0.306890 0.379605 0.259270 0.262244 0.213315
chargesum: 0.00000
title: Mulliken charges with hydrogens summed into heavy atoms:
elementType: S O O N C C C C C C
charge: 0.172320 -0.008896 -0.307224 -0.072628 0.170662 0.032547 -0.074603 -0.169375 0.292324 -0.035127
polarizability: 1.21419048e+02 -4.84230168e+00 9.16721532e+01 -2.75376135e+00 -1.58856663e+00 6.82336806e+01
1716.lowfreq: -13.9560 -0.0024 -0.0016 0.0012 3.1726 12.9553 63.2722 64.4677 73.2133
frequency: 63.2379 64.4331 73.1609 109.5332 147.3782 227.0836 269.4043 299.0445 326.5936 379.5502 431.0932 478.6723 510.1068 524.0696 538.2952 606.5033 611.3393 643.4652 712.7085 836.1057 880.0421 918.1633 985.8736 998.8229 1019.6677 1039.1665 1044.8068 1095.9655 1104.0109 1149.1597 1189.8972 1204.3431 1252.6566 1266.7104 1285.2214 1306.7967 1345.8354 1372.6523 1391.6360 1414.6129 1448.7197 1458.0498 1462.0850 1469.6016 1482.0214 1589.5823 2983.0971 2998.5710 3000.4964 3034.6993 3054.9696 3059.2087 3102.0878 3104.1013 3111.2033 3337.6353 3552.0356
redmass: 4.0015 2.1243 1.9690 2.5117 3.6418 2.7105 6.2021 4.5533 6.8309 3.0497 5.2330 2.0110 2.4720 1.3205 1.8887 3.5158 3.1679 3.8733 4.2203 1.6506 1.9360 4.7224 1.5297 2.3552 1.6752 2.5907 1.6637 2.2306 2.4748 1.8275 1.6284 1.2926 1.5746 1.2387 1.2037 1.4360 1.4402 1.2701 1.2321 1.1915 1.0461 1.2689 1.1307 1.1068 1.6836 5.6004 1.0650 1.0783 1.0370 1.0621 1.0915 1.0937 1.0978 1.1009 1.1091 1.0676 1.0785
irintensity: 1.6927 12.9763 6.0771 0.8060 13.6707 4.4202 1.5090 1.5848 13.4776 6.8434 14.0088 38.0074 90.6471 87.3540 72.4829 5.0579 17.9894 3.7712 37.6651 11.2377 9.2934 1.2477 1.5989 20.6474 57.2710 58.3732 17.2915 3.4148 32.2753 10.2205 8.2934 12.7516 24.4519 7.9452 19.1808 63.0753 15.6939 1.4147 63.1430 72.4086 16.0707 115.8171 33.8215 11.1153 137.3640 133.8600 22.6390 6.3110 11.6490 27.8346 12.8179 54.6375 5.2466 18.1976 20.9424 245.5928 19.9204
temp: 298.150 k
press: 1.00000 atm
elementType: 16 8 8 7 6 6 6 6 6 6 1 1 1 1 1 1 1 1 1 1 1
symmnumber: 1
zpe: 444807.4 jmol-1
zpe.correction: 0.169418 hartree
zpe.thermalcorrener: 0.180398 hartree
zpe.thermalcorrenthalpy: 0.181342 hartree
zpe.thermalcorrgfe: 0.132052 hartree
zpe.sumelectzpe: -837.710934 hartree
zpe.sumelectthermal: -837.699954 hartree
zpe.sumelectthermalent: -837.699010 hartree
zpe.sumelectthermalfe: -837.748300 hartree
dipole: 2.4818 6.3384 -1.3833
dipole: 6.9461
quadrupole: -66.5607 -70.6636 -67.3777
quadrupole: -0.3101 -5.7165 -1.1600
quadrupole: 1.6400 -2.4630 0.8229 -0.3101 -5.7165 -1.1600
hfenergy: -837.880352 hartree
pointgroup: C01 [X(C6H11N1O2S1)]
dipole: -0.9032643 -2.499961 -0.6344683 debye
dipolederiv: -0.5460436 0.2184781 -0.0789872 0.0837448 -0.1646716 0.0365373 -0.1265067 0.0884902 -0.226826 -0.8499681 0.1807976 -0.1093341 0.4080152 -0.7809805 -0.0222314 0.1621768 -0.1388585 -0.3309494 -0.7997566 -0.0804578 -0.0586031 0.0474886 -0.7796369 -0.2895206 0.1606497 -0.3341234 -0.6261521 -1.1826416 0.2402047 0.146825 0.2014403 -0.5396615 -0.0180123 0.1821265 0.0049909 -0.3731157 0.504023 0.0389061 0.0412945 0.2428042 0.0885452 0.0029957 0.0198215 -0.0799415 0.1400084 -0.0795384 -0.0073462 -0.0679566 -0.0295099 -0.0421927 -0.0093482 -0.0494156 0.0991395 0.173163 0.9882754 -0.3976394 0.1819476 -0.5740563 0.4913754 -0.0320547 0.1118876 0.0427251 0.4002015 0.0132509 -0.0241653 -0.0452057 -0.0646591 0.2905043 -0.0952115 0.0173326 -0.104898 0.14601 1.4288265 -0.2224415 -0.0440514 -0.3506692 0.8429724 0.4732579 -0.2059784 0.519309 0.5925815 -0.4091328 -0.0853716 -0.1229486 -0.045866 0.0117397 0.0034243 -0.1131615 -0.0086815 -0.0132249 0.0293185 0.0038437 0.0303154 -0.0233952 0.0428432 -0.0481731 -0.0198453 -0.006739 -0.0476262 0.0432291 0.00324 -0.0090456 0.0140502 0.0655358 -0.0101178 0.0011857 -0.0948726 -0.1504236 0.0485883 -0.1198018 0.0370111 -0.0701031 -0.1061948 0.0633382 0.0308779 0.0700967 0.0487527 -0.0670628 0.026828 -0.0697211 0.0020629 0.0309359 -0.0555619 -0.0187402 -0.0148547 -0.1444646 0.0713066 -0.0359772 0.0261146 -0.0002434 -0.028734 0.0661423 -0.0405349 0.0722725 -0.1363519 -0.0712278 0.0793716 0.0325626 0.1077214 -0.0595414 -0.0056027 0.0463163 -0.0355801 0.0682073 0.1392747 0.022949 -0.0084719 -0.0239221 0.2029074 -0.0968341 -0.0413607 -0.0985866 0.2096213 0.558251 0.1150291 0.0680741 0.1021704 0.3829915 0.0907651 -0.1039467 0.0686595 0.1922219 0.0485544 -0.0316453 0.0583892 -0.0604443 0.1082757 0.0065296 0.0946975 0.0326307 -0.0083666 0.0792263 0.0286772 -0.0382168 0.0530553 -0.0089592 0.0716698 -0.0785012 0.0454434 0.0721772 0.0532469 0.046521 0.030008 -0.0196846 -0.048054 -0.1319919 -0.0290812 -0.1266216 0.0145562 unknown
polarizability: 120.9277759|-4.6058877|91.5145124|6.273753|1.5684901|68.8825936 unknown
InChI: InChI=1S/C6H11NO2S/c1-4(8)7-5-2-3-10-6(5)9/h5-7,9H,2-3H2,1H3
charge 0 multiplicity 1
21 atoms
S  2.904938 0.748517 0.153756
O  0.42028 2.057276 -0.259335
O  -1.912387 0.96751 0.822522
N  -0.922296 -0.713546 -0.426734
C  0.413929 -0.418032 0.118976
C  1.403448 -1.590638 -0.006137
C  1.075707 0.823753 -0.533667
C  2.738625 -1.103569 0.599313
C  -2.028895 -0.002702 -0.00017
C  -3.377793 -0.436967 -0.548764
H  0.276013 -0.171423 1.191909
H  1.543784 -1.850468 -1.074797
H  1.031954 -2.487839 0.521894
H  1.163976 0.722186 -1.627864
H  2.738904 -1.195045 1.697654
H  3.604336 -1.640947 0.18336
H  -1.026108 -1.457716 -1.118391
H  -0.264965 1.928591 0.462277
H  -4.044178 -0.689997 0.293537
H  -3.838896 0.409639 -1.085526
H  -3.317277 -1.302979 -1.229915
