program: Gaussian 09
title: 000194501
version: EM64L-G09RevD.01
frameworkgroup: C1[X(C14H20O5)]
method: RPBEPBE
basis: SDD
operation: Freq
keyword: #pfreq=noraman
keyword: PBEPBE/SDD
title: #p freq=noraman PBEPBE/SDD
converged: YES YES NO NO
title: Mulliken charges:
elementType: O O O O O C C C C C C C C C C C C C C H H H H H H H H H H H H H H H H H H H H
charge: -0.258233 -0.431842 -0.273855 -0.415716 -0.242504 -0.564502 -0.356276 0.241751 -0.349919 0.155212 0.291746 -0.029514 -0.346415 -0.526552 -0.780345 -0.467236 -0.716092 0.077953 0.202104 0.222292 0.226100 0.202483 0.196642 0.235449 0.178205 0.197185 0.187226 0.262616 0.252616 0.244082 0.213554 0.247135 0.240199 0.272080 0.197206 0.216651 0.234825 0.382159 0.381531
chargesum: 0.00000
title: Mulliken charges with hydrogens summed into heavy atoms:
elementType: O O O O O C C C C C C C C C C C C C C
charge: -0.258233 -0.049683 -0.273855 -0.034185 -0.242504 -0.116110 0.042849 0.241751 0.063735 0.155212 0.291746 -0.029514 0.037996 -0.011320 -0.075575 0.045043 -0.067410 0.077953 0.202104
polarizability: 1.95464559e+02 -5.15210830e+00 1.77781621e+02 1.57599705e+01 9.08646190e+00 1.29511401e+02
1716.lowfreq: -4.6960 -0.0009 -0.0009 -0.0007 4.1559 6.3913 13.7139 23.7075 27.5377
frequency: 10.9564 23.6251 27.3965 49.7066 53.8218 66.2231 74.0285 87.1492 100.9023 110.2386 127.4615 139.0615 144.0995 195.1040 200.4890 248.3223 262.0151 271.0069 283.1050 300.8169 352.3507 376.4697 387.9711 403.3347 409.9970 476.2740 521.8048 536.0011 563.7035 583.2228 597.9055 606.1810 666.3676 671.2066 683.9835 694.2339 732.6008 756.3485 774.1355 782.3411 805.0633 835.7523 899.2575 914.9093 925.1484 938.1963 957.7027 980.2225 1005.0451 1022.2512 1033.3752 1044.9583 1047.4937 1080.1905 1087.1663 1108.1222 1129.3716 1134.6000 1171.9424 1186.5953 1207.2599 1213.1597 1232.3362 1267.0731 1273.9437 1285.1623 1293.8010 1300.4499 1308.3963 1322.0795 1332.8296 1343.2054 1354.4803 1364.1634 1388.6615 1399.1524 1417.9121 1441.6887 1452.5729 1453.9097 1458.3278 1461.6040 1467.7376 1472.1127 1477.6288 1482.5707 1493.6399 1566.5064 1622.7117 1635.5920 1659.9013 2960.7796 2964.5041 2965.8152 2971.0701 2989.5578 2991.5749 3008.4792 3019.3517 3024.3798 3032.6485 3045.7439 3052.4878 3062.6231 3071.4502 3074.9694 3092.1270 3093.4645 3118.2300 3511.1000 3513.9258
redmass: 5.5955 6.3649 5.3836 7.0202 5.1773 9.0631 1.8137 2.9709 3.3228 3.7117 1.0542 3.8959 2.6285 3.3488 3.9139 1.1501 3.1199 3.3903 2.3393 3.1077 4.8235 4.9141 2.5540 4.0807 2.6012 3.5398 4.2468 3.0627 3.5332 1.4656 2.1906 1.7963 3.7399 4.4233 3.5183 3.2821 1.1391 6.7377 2.2152 2.6075 2.4782 1.5324 2.2430 2.0080 2.3871 1.5859 2.4734 3.9287 3.2875 2.0766 2.0853 1.6222 2.4792 1.9139 2.2665 2.0170 2.0655 2.1767 2.0246 1.2515 1.6561 1.5830 1.3952 1.5975 1.2872 1.2317 1.6968 1.1041 2.3053 1.4493 1.5365 1.7072 1.7415 1.6411 1.2183 1.6246 2.6768 1.1742 1.0992 1.1018 1.0489 1.0863 1.0716 1.0774 1.0497 1.0768 1.0651 9.4341 7.5520 7.9376 8.3458 1.0593 1.0589 1.0391 1.0625 1.0611 1.0372 1.0949 1.0991 1.0587 1.0615 1.1004 1.1018 1.1005 1.1000 1.0974 1.1000 1.1034 1.1022 1.0641 1.0638
irintensity: 0.7458 0.4859 0.4031 0.8281 0.9321 1.3045 0.0533 0.0509 1.3128 0.5399 0.0433 1.6881 0.1029 0.2058 0.1464 0.0297 0.4203 3.4401 4.0202 2.1421 2.0358 2.7537 0.3718 3.2010 4.5321 1.0690 42.3171 12.4078 4.5509 128.8342 42.5096 49.7820 71.4105 21.8508 16.2735 24.0101 9.9294 6.4142 1.8140 2.0907 0.9851 0.7079 5.8053 6.7554 11.5083 10.2465 54.1850 366.4025 7.8887 2.0513 28.6242 4.3012 3.6272 66.2715 6.4225 3.7394 11.2581 164.6875 1.3287 8.9746 18.1286 3.8104 0.1377 5.9326 0.2268 0.8183 16.5122 0.7574 64.0737 3.7608 5.4186 21.1827 1.4981 2.2687 13.1825 42.7866 1.9161 16.2137 16.4037 21.3262 8.1931 3.3525 0.8468 16.0912 10.2057 6.2679 16.0566 106.4266 110.2490 187.4498 227.1269 9.6267 4.1301 29.2510 103.2817 21.1911 30.4425 14.2574 9.9908 8.7253 17.3361 21.8596 25.3596 98.7356 67.1450 14.4755 20.4976 2.7622 5.2815 20.5436 43.8708
temp: 298.150 k
press: 1.00000 atm
elementType: 8 8 8 8 8 6 6 6 6 6 6 6 6 6 6 6 6 6 6 1 1 1 1 1 1 1 1 1 1 1 1 1 1 1 1 1 1 1 1
symmnumber: 1
zpe: 835437.1 jmol-1
zpe.correction: 0.318201 hartree
zpe.thermalcorrener: 0.339381 hartree
zpe.thermalcorrenthalpy: 0.340325 hartree
zpe.thermalcorrgfe: 0.264603 hartree
zpe.sumelectzpe: -920.163460 hartree
zpe.sumelectthermal: -920.142280 hartree
zpe.sumelectthermalent: -920.141336 hartree
zpe.sumelectthermalfe: -920.217059 hartree
dipole: 0.3468 -1.5758 1.0913
dipole: 1.9479
quadrupole: -107.2675 -107.1702 -115.6470
quadrupole: 2.8032 5.3971 2.9855
quadrupole: 2.7607 2.8580 -5.6188 2.8032 5.3971 2.9855
hfenergy: -920.4816613 hartree
pointgroup: C01 [X(C14H20O5)]
dipole: -0.1164815 0.6162463 0.4404614 debye
polarizability: 195.0105987|-5.4158471|178.3764984|-16.3944565|-7.7659781|129.3704838 unknown
InChI: InChI=1S/C14H20O5/c1-3-4-5-6-10-9(2)13(14(17)18)11(19-10)7-8-12(15)16/h15,17H,3-8H2,1-2H3
charge 0 multiplicity 1
39 atoms
O  0.01769 0.189404 1.295515
O  3.863658 0.963754 -1.196498
O  3.588299 -1.269243 -0.631796
O  -1.633319 -3.095721 0.653061
O  -1.25089 -2.022977 -1.369119
C  -0.987839 2.460791 1.22596
C  -2.185176 2.453123 0.226966
C  0.133628 1.542758 0.846727
C  -2.877931 1.078828 0.095559
C  1.292316 1.678892 0.099207
C  1.115274 -0.517795 0.807678
C  1.921737 0.356092 0.069448
C  -4.096597 1.100953 -0.854756
C  1.180239 -1.978432 1.122362
C  1.778931 2.946383 -0.552493
C  0.662005 -2.881414 -0.047446
C  -4.733305 -0.296105 -1.025439
C  3.152939 -0.085258 -0.584675
C  -0.794151 -2.61422 -0.365103
H  -0.589681 3.489936 1.306053
H  -1.354962 2.179377 2.231855
H  -1.826844 2.780839 -0.769684
H  -2.922198 3.20974 0.566512
H  -2.151844 0.331051 -0.275631
H  -3.19969 0.733325 1.100765
H  -3.776588 1.480131 -1.846581
H  -4.853713 1.817132 -0.473964
H  2.23157 -2.259084 1.303168
H  0.58831 -2.181438 2.031527
H  1.828236 2.837588 -1.650605
H  1.109501 3.791933 -0.318313
H  2.799924 3.199311 -0.218913
H  0.777371 -3.936574 0.256722
H  1.264591 -2.697537 -0.950091
H  -5.091497 -0.688217 -0.053257
H  -5.597701 -0.268724 -1.714163
H  -3.992345 -1.008664 -1.435085
H  4.676361 0.575101 -1.620731
H  -2.576409 -2.85674 0.43966
