program: Gaussian 09
title: 000194468
version: EM64L-G09RevD.01
frameworkgroup: C1[X(C15H17N3)]
method: RPBEPBE
basis: SDD
operation: Freq
keyword: #pfreq=noraman
keyword: PBEPBE/SDD
title: #p freq=noraman PBEPBE/SDD
converged: YES YES NO NO
title: Mulliken charges:
elementType: N N N C C C C C C C C C C C C C C C H H H H H H H H H H H H H H H H H
charge: -0.484421 -0.114101 -0.105349 0.297040 0.150511 -0.204113 0.164402 0.201856 -0.541363 -0.683710 -0.711523 -0.415775 -0.363616 -0.254026 -0.221790 -0.195265 -0.195947 -0.332606 0.215176 0.247247 0.216385 0.305228 0.202915 0.218875 0.259351 0.234078 0.233294 0.191102 0.230781 0.230990 0.222090 0.222892 0.253806 0.277082 0.248504
chargesum: 0.00000
title: Mulliken charges with hydrogens summed into heavy atoms:
elementType: N N N C C C C C C C C C C C C C C C
charge: -0.179193 -0.114101 -0.105349 0.297040 0.150511 0.011062 0.164402 0.201856 -0.077731 -0.002569 -0.053049 -0.184994 -0.132627 -0.031936 0.001102 0.058540 0.081135 -0.084102
polarizability: 2.25713381e+02 -2.21863298e+01 1.80991776e+02 -1.41592522e+01 -3.37185022e+00 1.25350949e+02
1716.lowfreq: -11.3037 -4.7688 0.0002 0.0003 0.0005 6.1366 15.5896 23.3759 41.0468
frequency: 15.4951 22.9268 41.0290 57.4726 79.2547 144.0732 151.2906 179.8234 208.9009 215.4015 240.5774 249.8355 281.1530 306.0748 330.5695 403.8890 410.0560 457.1270 485.5035 547.1449 564.3224 576.8708 593.9776 611.6515 634.0635 653.2660 675.8199 721.7766 722.8416 748.1951 753.4156 787.0566 790.9417 802.3014 834.5782 851.3060 872.3772 881.0487 888.2194 914.7279 929.9418 953.7561 971.1665 996.2775 1004.6316 1017.5374 1050.3298 1062.0493 1096.4171 1105.0296 1109.9901 1132.0334 1164.3890 1172.2652 1193.7880 1207.6033 1238.0119 1240.5509 1254.7442 1287.4491 1289.1109 1306.7524 1323.8175 1329.6753 1351.0165 1376.6342 1378.6633 1396.1810 1410.8789 1432.2216 1438.3542 1461.8967 1465.4861 1467.7838 1471.3756 1480.1885 1486.2831 1488.0699 1488.7647 1570.4818 1589.3872 1631.2950 2972.1530 2978.2258 2987.4969 2992.8097 3042.8707 3061.9426 3074.2081 3085.8917 3091.8644 3122.4686 3129.6326 3144.1834 3163.4064 3217.8074 3239.5165 3248.5386 3605.5836
redmass: 4.6359 3.0517 3.4043 5.4996 3.5866 3.2817 4.8423 4.1705 2.7462 1.1789 1.7785 1.4843 2.8215 3.5522 3.6899 3.6891 2.6854 3.7136 4.0798 1.1426 3.1171 3.7705 5.4396 3.2733 4.1638 3.7837 5.0752 1.8575 1.8546 1.5966 3.3509 1.8905 2.2707 3.1754 1.4114 1.5234 4.2419 6.0148 2.4132 1.1874 1.3845 1.4564 1.3020 2.5090 4.2060 1.9672 1.5880 1.4935 2.6106 1.8321 2.3475 1.8206 1.3545 1.4562 1.8460 1.7358 1.4677 2.1120 1.8634 1.5309 1.4909 2.9431 5.0138 1.4978 1.9861 1.9377 1.2195 1.3064 3.9290 2.5116 2.7996 2.9989 1.0526 1.3420 1.7677 2.1421 1.1323 1.4579 1.2241 7.1607 6.1177 7.0412 1.0382 1.0376 1.0796 1.0602 1.1031 1.0972 1.0996 1.1007 1.1002 1.0856 1.0888 1.0948 1.1000 1.0907 1.0982 1.1087 1.0799
irintensity: 1.1795 0.4367 1.2962 2.2046 0.3017 0.0230 0.6110 1.2492 2.2079 0.1439 1.4860 0.3804 0.0838 1.9688 1.2599 5.5857 0.4100 3.1427 1.3688 72.6958 6.4456 1.5081 4.7030 9.5416 3.5663 12.4572 11.7426 23.3580 26.9463 82.6805 17.9385 50.1282 15.3929 1.7966 2.0227 0.0457 1.3072 8.7064 3.5816 3.6387 2.4369 0.8284 0.0195 8.8161 9.1864 2.8404 38.3280 14.2905 6.7006 14.9163 6.5319 3.6575 4.1219 3.9055 28.3548 50.7970 18.5151 13.0524 22.3553 8.8073 3.1366 54.9112 0.7911 1.2048 10.8886 6.5033 10.5276 13.9930 27.2663 53.6507 6.8206 14.3188 1.5026 7.1508 13.4904 3.7071 18.7301 22.7390 12.8801 16.0480 4.2881 2.2202 24.7962 29.7429 25.5409 28.4371 12.6075 23.1709 60.0030 29.5887 28.7391 4.9785 2.2636 33.5307 30.6328 2.6790 3.7915 4.0126 45.6559
temp: 298.150 k
press: 1.00000 atm
elementType: 7 7 7 6 6 6 6 6 6 6 6 6 6 6 6 6 6 6 1 1 1 1 1 1 1 1 1 1 1 1 1 1 1 1 1
symmnumber: 1
zpe: 757757.9 jmol-1
zpe.correction: 0.288615 hartree
zpe.thermalcorrener: 0.304921 hartree
zpe.thermalcorrenthalpy: 0.305865 hartree
zpe.thermalcorrgfe: 0.242465 hartree
zpe.sumelectzpe: -744.760159 hartree
zpe.sumelectthermal: -744.743853 hartree
zpe.sumelectthermalent: -744.742909 hartree
zpe.sumelectthermalfe: -744.806308 hartree
dipole: 2.1383 4.4431 2.6359
dipole: 5.5912
quadrupole: -107.7421 -101.4429 -110.4774
quadrupole: -6.0982 -15.0059 -8.6052
quadrupole: -1.1879 5.1112 -3.9233 -6.0982 -15.0059 -8.6052
hfenergy: -745.0487738 hartree
pointgroup: C01 [X(C15H17N3)]
dipole: -1.0374469 1.6673275 -0.9912835 debye
polarizability: 219.6646455|27.9629027|187.572228|-9.5294116|5.6737362|124.8192321 unknown
InChI: InChI=1S/C15H17N3/c1-11(2)15-13(9-18-8-7-16-10-18)12-5-3-4-6-14(12)17-15/h3-8,10-11,17H,9H2,1-2H3
charge 0 multiplicity 1
35 atoms
N  -1.73055 1.439607 0.353516
N  2.208232 -0.573253 -0.414325
N  3.295636 -1.360924 1.416758
C  -0.433897 1.445155 -0.184769
C  -0.16909 0.171854 -0.710743
C  0.462206 2.66088 -0.090536
C  -1.348429 -0.647117 -0.486606
C  -2.318318 0.179966 0.181647
C  1.107505 -0.268868 -1.373977
C  1.173626 2.727817 1.292988
C  -0.291359 3.982471 -0.392401
C  -1.685004 -1.995004 -0.783326
C  -3.596233 -0.293232 0.546941
C  -2.958321 -2.475124 -0.41913
C  -3.904854 -1.634211 0.237305
C  3.572931 -0.326327 -0.620627
C  2.09188 -1.200869 0.823007
C  4.225057 -0.815173 0.51547
H  1.250534 2.536502 -0.85923
H  0.916535 -1.168426 -1.988959
H  1.492439 0.512658 -2.054635
H  -2.179253 2.245025 0.784442
H  0.436995 2.843269 2.110181
H  1.862287 3.591869 1.329638
H  1.756405 1.810671 1.485776
H  -0.813114 3.941899 -1.365197
H  0.41909 4.828056 -0.414893
H  -1.038414 4.213946 0.392347
H  -0.96829 -2.657185 -1.283074
H  -4.325158 0.348777 1.054101
H  -3.230257 -3.513278 -0.639763
H  -4.886497 -2.038526 0.507719
H  3.94367 0.1544 -1.522804
H  1.135041 -1.502699 1.240655
H  5.289167 -0.806308 0.740708
