program: Gaussian 09
title: 000194469
version: EM64L-G09RevD.01
frameworkgroup: C1[X(C19H26N2O3)]
method: RPBEPBE
basis: SDD
operation: Freq
keyword: #p
keyword: freq=noraman
keyword: PBEPBE/SDD
title: #p freq=noraman PBEPBE/SDD
converged: YES YES NO NO
title: Mulliken charges:
elementType: O O O N N C C C C C C C C C C C C C C C C C C C H H H H H H H H H H H H H H H H H H H H H H H H H H
charge: -0.437645 -0.312935 -0.241789 -0.338980 -0.072848 0.261865 -0.419211 -0.118604 -0.685282 -0.687142 -0.728178 -0.342054 0.257514 0.293843 -0.360846 -0.370052 -0.263701 -0.232527 -0.264246 -0.343555 0.358712 -0.509294 0.212011 -0.768295 0.265209 0.200476 0.232420 0.231531 0.219680 0.205960 0.224274 0.207341 0.225518 0.205670 0.205770 0.228238 0.209208 0.235148 0.236256 0.339817 0.250020 0.227177 0.283005 0.229998 0.229945 0.230994 0.264268 0.252167 0.236871 0.236275
chargesum: 0.00000
title: Mulliken charges with hydrogens summed into heavy atoms:
elementType: O O O N N C C C C C C C C C C C C C C C C C C C
charge: -0.097828 -0.312935 -0.241789 -0.073772 -0.072848 0.261865 0.013684 0.112928 -0.035368 -0.048614 -0.084962 0.129350 0.257514 0.293843 -0.110825 -0.142875 0.019304 -0.002529 -0.034300 -0.112561 0.358712 -0.245026 0.212011 -0.042981
polarizability: 3.65768976e+02 5.77542219e+01 2.71084151e+02 -3.15404891e+00 -2.96551188e+01 1.61087213e+02
1716.lowfreq: -5.0025 -0.0005 0.0002 0.0008 0.7503 2.3669 5.8699 20.1274 27.1287
frequency: 2.2313 20.0255 27.0908 29.0499 38.0473 53.2298 61.8459 82.9036 93.2255 107.3714 118.2552 130.4724 161.1133 166.5867 183.4580 198.6263 216.4717 228.1054 230.0930 241.2586 256.6269 259.3299 292.5549 298.5404 321.0407 333.3049 355.0570 360.3519 377.7249 409.7953 427.1843 439.8068 466.1177 472.9130 500.7099 507.8587 529.5627 538.2945 576.4195 609.8535 624.6785 650.9833 666.5975 709.5019 737.7127 744.0961 749.7045 755.3638 797.9649 817.5569 819.3047 828.4258 852.2191 854.7675 878.0045 889.6224 905.4183 921.3239 924.5566 930.3724 937.1993 939.4282 960.5540 968.7885 975.4861 997.1824 1002.2382 1003.4976 1019.0612 1022.0243 1045.6546 1047.2227 1064.6561 1092.8750 1105.7533 1138.7067 1140.8409 1174.2480 1177.3532 1199.5121 1212.1557 1218.1051 1227.5465 1235.5483 1242.3904 1245.1004 1283.5025 1290.3679 1294.9842 1311.2321 1323.7426 1352.4539 1368.3615 1369.5437 1371.1592 1377.2781 1384.4908 1386.0394 1397.3896 1402.9075 1438.1308 1441.7161 1448.8891 1453.1650 1455.8842 1460.5979 1465.1638 1467.7053 1471.9498 1474.4207 1480.2448 1484.1850 1489.2181 1495.0996 1557.2258 1582.3111 1602.6659 1641.6452 2896.7729 2969.4798 2972.8350 2982.5060 2986.1584 2992.3781 3054.3601 3058.9832 3062.8251 3067.3423 3071.1374 3072.2494 3075.2511 3076.6763 3085.9958 3092.3170 3109.2275 3127.6455 3132.8201 3142.1516 3151.2278 3161.5956 3174.4836 3234.2198 3409.5726 3544.0981
redmass: 4.4108 4.4974 3.3515 4.2858 4.3784 4.6529 4.5802 3.5775 4.7377 3.8118 1.0751 3.2218 3.4171 1.3392 5.5214 3.3310 1.6965 4.0914 2.8709 1.1648 1.0842 2.6036 3.3110 2.9220 3.3946 2.3495 4.9915 1.4803 1.7129 3.3478 3.1721 2.4267 3.1315 2.5505 3.5928 4.0063 4.0969 3.6005 5.6714 5.8231 4.4143 4.5768 3.4461 1.9976 3.5242 3.0851 3.0710 1.2755 4.7639 1.4007 5.7833 3.9923 1.8804 2.8256 1.9793 1.9777 1.8166 1.6038 2.6239 6.6009 1.4442 1.2299 3.1381 2.0150 1.3320 1.7152 1.1658 2.5934 1.4061 1.5712 2.1161 1.4987 2.1198 2.4959 3.1920 2.1499 1.4885 1.1074 1.2311 1.5953 2.6188 3.6104 1.4274 2.3220 3.3720 1.6487 1.8812 1.4074 1.8927 1.3622 1.4620 1.3110 1.3103 1.2160 1.2250 1.3692 3.6788 2.9048 1.2105 1.4672 3.6442 2.3309 1.1697 1.1615 1.2109 1.0553 1.0523 1.0448 1.1565 1.2508 1.0772 1.6936 1.1341 1.0585 6.1124 6.5225 6.0227 5.9325 1.0710 1.0357 1.0360 1.0357 1.0551 1.0369 1.0897 1.1033 1.0987 1.0988 1.0977 1.0935 1.0984 1.0960 1.1004 1.0996 1.0989 1.0919 1.0858 1.0900 1.0870 1.0946 1.0985 1.0990 1.0734 1.0656
irintensity: 0.6512 0.9103 0.9388 4.5981 0.4216 0.5384 0.0653 0.5084 2.7731 0.3600 0.0079 2.4375 0.2814 1.0951 0.1815 1.7230 1.2565 1.5783 0.6802 0.1259 0.1963 1.7467 2.3450 0.0812 6.6212 0.3543 0.5704 64.8879 74.1286 11.2190 5.6646 7.7665 5.2228 1.4410 8.4198 2.1147 12.6844 0.3129 6.1196 0.0828 5.4828 14.9286 3.6603 50.4605 2.3063 0.9356 22.0358 88.0559 11.9360 24.6574 5.4271 13.9807 0.4922 1.4929 21.7294 12.5736 3.3502 5.7913 20.3561 10.3418 4.1082 0.9813 56.9043 1.4915 2.3046 50.2922 52.7681 7.9633 4.5125 10.9145 10.7164 6.2019 27.5147 32.5141 21.8992 13.6833 2.3523 13.8770 38.8231 8.2703 45.4853 152.8672 54.2559 30.7271 48.7401 40.1830 7.7974 0.1899 13.2008 11.1670 8.4720 3.7003 17.0999 31.9740 40.0395 17.1401 42.8719 13.9865 15.3565 34.5144 69.7275 46.9459 8.8118 4.6522 31.2525 2.9302 0.3116 16.7383 22.5253 26.2219 8.6447 18.7273 10.9904 17.3131 91.4897 11.1316 35.8769 75.0309 68.6379 23.0506 31.4608 17.4965 34.9765 29.2436 16.7354 21.7497 4.2931 8.8670 9.7979 115.2394 14.2851 58.6854 8.3036 60.4168 8.5578 7.4799 2.7072 7.7672 12.6034 29.7680 22.2493 1.3949 1.3615 6.6392
temp: 298.150 k
press: 1.00000 atm
elementType: 8 8 8 7 7 6 6 6 6 6 6 6 6 6 6 6 6 6 6 6 6 6 6 6 1 1 1 1 1 1 1 1 1 1 1 1 1 1 1 1 1 1 1 1 1 1 1 1 1 1
symmnumber: 1
zpe: 1086818.1 jmol-1
zpe.correction: 0.413947 hartree
zpe.thermalcorrener: 0.439668 hartree
zpe.thermalcorrenthalpy: 0.440613 hartree
zpe.thermalcorrgfe: 0.353608 hartree
zpe.sumelectzpe: -1072.907416 hartree
zpe.sumelectthermal: -1072.881695 hartree
zpe.sumelectthermalent: -1072.880750 hartree
zpe.sumelectthermalfe: -1072.967755 hartree
dipole: -1.3634 3.2289 -2.7412
dipole: 4.4496
quadrupole: -121.4135 -134.8223 -154.6240
quadrupole: -1.7061 -2.3275 -0.6998
quadrupole: 15.5398 2.1309 -17.6707 -1.7061 -2.3275 -0.6998
hfenergy: -1073.321363 hartree
pointgroup: C01 [X(C19H26N2O3)]
dipole: 0.2322742 1.3107128 1.1369517 debye
polarizability: 380.7875589|-43.1765728|254.3452169|11.3982792|27.2696494|162.8075641 unknown
InChI: InChI=1S/C19H26N2O3/c1-14-11-17(24-21-14)10-9-15-7-5-6-8-18(15)23-13-16(22)12-20-19(2,3)4/h5-11,16,20,22H,12-13H2,1-4H3
charge 0 multiplicity 1
50 atoms
O  -2.216052 -1.238141 -3.162454
O  -1.862872 0.462939 -0.675709
O  2.784635 -0.087119 -0.093062
N  -1.681928 -2.499742 0.365258
N  4.123731 -0.700022 -0.161679
C  -0.954481 -3.608192 1.074679
C  -1.414498 -2.309294 -1.075838
C  -2.582745 -1.569237 -1.774422
C  0.587374 -3.538045 0.864898
C  -1.497804 -4.972994 0.583101
C  -1.282741 -3.44202 2.578575
C  -3.067647 -0.32249 -1.023421
C  -2.008169 1.712108 -0.05998
C  -0.787866 2.330118 0.379436
C  -3.25781 2.347604 0.126494
C  -0.883168 3.615661 0.982338
C  0.471167 1.60164 0.21423
C  -3.310545 3.621686 0.732294
C  -2.121865 4.261811 1.156361
C  1.729507 2.036074 0.554695
C  2.919252 1.229395 0.392951
C  4.269956 1.474816 0.635119
C  4.967056 0.268092 0.280773
C  6.442222 -0.01695 0.344999
H  -1.524872 -1.611761 0.866123
H  -0.47301 -1.746034 -1.27969
H  -1.311593 -3.291558 -1.566312
H  -3.447212 -2.247965 -1.874764
H  0.993577 -2.568717 1.211205
H  1.098078 -4.343619 1.424974
H  0.855266 -3.650756 -0.201616
H  -1.271548 -5.146858 -0.484893
H  -2.593088 -5.015245 0.716268
H  -1.03623 -5.79757 1.156488
H  -0.90727 -2.47297 2.962166
H  -2.375075 -3.478797 2.738748
H  -0.809789 -4.244651 3.171887
H  -3.727271 0.265384 -1.689489
H  -3.603737 -0.600322 -0.09584
H  -1.403146 -0.669765 -3.134858
H  -4.183727 1.863452 -0.195264
H  0.030811 4.110059 1.329079
H  0.383163 0.599978 -0.220525
H  -4.280183 4.111846 0.871901
H  -2.166108 5.250399 1.624478
H  1.90016 3.033192 0.977215
H  4.710539 2.394492 1.012889
H  6.647974 -1.043416 0.000872
H  7.007749 0.686031 -0.292693
H  6.819333 0.088371 1.378115
