program: Gaussian 09
title: 000194466
version: EM64L-G09RevD.01
frameworkgroup: C1[X(C10H14NO6P)]
method: RPBEPBE
basis: SDD
operation: Freq
keyword: #p
keyword: freq=noraman
keyword: PBEPBE/SDD
title: #p freq=noraman PBEPBE/SDD
converged: YES YES NO NO
title: Mulliken charges:
elementType: P O O O O O O N C C C C C C C C C C H H H H H H H H H H H H H H
charge: 1.372134 -0.262428 -0.497294 -0.736327 -0.665143 -0.581231 -0.305945 -0.463577 0.206907 0.189484 0.522842 -0.519905 -0.315112 -0.412196 -0.230732 -0.684543 0.270283 -0.763698 0.316458 0.256139 0.237576 0.314894 0.251678 0.232601 0.213631 0.224025 0.229358 0.218436 0.266186 0.263427 0.442294 0.409781
chargesum: 0.00000
title: Mulliken charges with hydrogens summed into heavy atoms:
elementType: P O O O O O O N C C C C C C C C C C
charge: 1.372134 -0.262428 -0.497294 -0.294033 -0.255363 -0.581231 -0.305945 -0.148683 0.206907 0.189484 0.522842 -0.203448 -0.058973 -0.174620 0.253547 -0.017530 0.270283 -0.015648
polarizability: 2.29102208e+02 5.30354243e-01 1.73743415e+02 -2.18462322e+00 -8.83728387e+00 9.94188367e+01
1716.lowfreq: -7.3352 0.0017 0.0018 0.0020 3.0029 12.0625 30.9968 54.0326 62.4671
frequency: 30.9081 54.0087 62.4641 77.0405 94.1512 101.6912 104.2697 113.3708 137.4737 157.6568 170.2170 182.3564 204.3221 240.2531 246.5869 261.8772 282.6044 319.1936 321.1380 345.9890 355.7224 371.7083 384.8217 403.8822 473.1114 491.8157 527.2582 538.7478 577.0106 609.8342 613.0367 618.8233 642.9656 707.6540 718.0232 731.2372 767.8365 788.0100 811.0655 818.8513 862.0224 888.0916 934.8326 939.0349 962.1954 984.3131 1012.7406 1017.9596 1022.6664 1044.8059 1085.9689 1107.7683 1118.1457 1134.8386 1149.0923 1166.4425 1221.8220 1242.3487 1258.6974 1263.0901 1274.9057 1367.0515 1382.3628 1393.8180 1396.5903 1411.0590 1447.6127 1461.4592 1465.7293 1474.7579 1477.1218 1488.3450 1500.9788 1583.5191 1590.8967 1626.9511 2852.0656 2994.1359 3000.9215 3005.7751 3074.4366 3092.5227 3100.4223 3106.4754 3107.0537 3137.8106 3171.3570 3197.5629 3540.2306 3583.8678
redmass: 4.0723 6.6411 6.2054 2.4976 4.0716 1.5456 2.0265 2.8642 5.1526 3.4635 5.4702 4.1350 4.9131 2.6755 1.1665 4.2310 3.7537 3.8856 6.1183 7.9790 5.4071 6.8778 6.1287 4.6130 4.3896 4.6238 6.1423 4.1821 4.4296 4.9993 2.5586 1.8284 4.3254 4.6447 7.8294 6.8021 4.6546 9.2540 1.5157 1.0854 1.3442 3.6104 3.2376 1.5539 3.5411 1.6272 1.5701 1.9476 1.3830 1.6288 2.7219 2.9904 2.3706 1.4462 1.4445 1.0916 2.1514 2.2198 1.7394 1.2355 2.0607 1.4073 5.3094 1.2544 1.3594 3.6943 1.0451 1.0405 1.4607 1.4297 1.1107 1.2283 2.4267 7.4524 4.8820 6.6947 1.0822 1.0355 1.0362 1.0589 1.1062 1.0986 1.0981 1.1009 1.1035 1.0896 1.0951 1.0923 1.0773 1.0656
irintensity: 2.9927 5.2765 2.9989 0.7124 3.9714 1.8030 1.1561 6.0989 22.2957 19.2944 2.2232 32.9766 6.3620 45.5649 0.4046 5.2942 9.9467 13.8911 3.2748 28.2924 18.0965 17.1844 27.0431 8.1265 1.8045 49.8942 13.7796 32.3021 5.2267 14.8815 45.3756 37.6970 18.3584 1.8166 131.3280 137.7138 46.7030 140.9707 33.4730 4.3821 176.6871 61.3351 2.1406 0.9010 31.8768 77.6401 4.6611 59.3198 123.2445 16.1675 53.6992 94.5147 24.6158 7.7494 7.6912 95.8683 25.5487 253.3358 10.2458 4.7177 76.9782 16.4863 80.0755 88.0576 42.4643 74.7392 16.4814 12.5601 73.5185 3.0686 24.6724 109.0669 190.7269 40.1822 203.1344 20.2647 1361.1927 24.2574 7.5668 14.4378 2.9926 25.8769 5.3086 13.2092 40.8324 9.6463 4.9638 0.5058 24.3393 90.6448
temp: 298.150 k
press: 1.00000 atm
elementType: 15 8 8 8 8 8 8 7 6 6 6 6 6 6 6 6 6 6 1 1 1 1 1 1 1 1 1 1 1 1 1 1
symmnumber: 1
zpe: 623156.7 jmol-1
zpe.correction: 0.237348 hartree
zpe.thermalcorrener: 0.256813 hartree
zpe.thermalcorrenthalpy: 0.257758 hartree
zpe.thermalcorrgfe: 0.189349 hartree
zpe.sumelectzpe: -1235.417985 hartree
zpe.sumelectthermal: -1235.398520 hartree
zpe.sumelectthermalent: -1235.397575 hartree
zpe.sumelectthermalfe: -1235.465984 hartree
dipole: 6.2390 -4.1366 -2.0644
dipole: 7.7652
quadrupole: -85.6253 -109.4930 -119.6848
quadrupole: -6.6406 0.8662 -9.0614
quadrupole: 19.3091 -4.5586 -14.7505 -6.6406 0.8662 -9.0614
hfenergy: -1235.655333 hartree
pointgroup: C01 [X(C10H14N1O6P1)]
dipole: 2.3458674 -1.8992997 -0.4722774 debye
polarizability: 228.9097747|-3.5439651|167.7414109|-3.2379709|-22.2248294|105.6132743 unknown
InChI: InChI=1S/C10H14NO6P/c1-3-16-9-5-4-8(11-7(2)12)6-10(9)17-18(13,14)15/h4-6,11,13-14H,3H2,1-2H3
charge 0 multiplicity 1
32 atoms
P  -0.820909 2.127859 -0.491583
O  -2.817419 -1.603284 0.114614
O  -1.326574 0.64134 -1.366698
O  0.838129 2.343918 -0.740648
O  -1.398065 3.302663 -1.580419
O  -1.42512 2.177666 0.969427
O  2.887409 0.867376 -0.023996
N  2.827647 -1.476948 -0.217306
C  -1.451274 -1.533875 -0.106864
C  -0.727914 -0.539107 -0.827551
C  1.401483 -1.615857 -0.284679
C  0.666257 -0.644584 -0.98227
C  -0.697169 -2.600694 0.464335
C  0.708177 -2.628715 0.423981
C  -3.704051 -0.419879 -0.126774
C  -5.098816 -0.85235 0.311914
C  3.479958 -0.263205 -0.060336
C  4.992383 -0.336091 0.079928
H  1.167108 0.076013 -1.630025
H  -1.256553 -3.365716 1.010958
H  1.252819 -3.405669 0.972101
H  3.396932 -2.324257 -0.164581
H  -3.325488 0.430998 0.469016
H  -3.665305 -0.155531 -1.197539
H  -5.808661 -0.019282 0.157919
H  -5.446465 -1.72042 -0.274576
H  -5.108149 -1.124444 1.381236
H  5.38655 -1.366255 0.06201
H  5.28727 0.146612 1.027111
H  5.460969 0.238697 -0.737365
H  1.572772 1.738611 -0.345188
H  -0.68023 3.687911 -2.146349
