program: Gaussian 09
title: 000194450
version: EM64L-G09RevD.01
frameworkgroup: C1[X(C19H32ClN)]
method: RPBEPBE
basis: SDD
operation: Freq
keyword: #p
keyword: freq=noraman
keyword: PBEPBE/SDD
title: #p freq=noraman PBEPBE/SDD
converged: YES YES NO NO
title: Mulliken charges:
elementType: Cl N C C C C C C C C C C C C C C C C C C C H H H H H H H H H H H H H H H H H H H H H H H H H H H H H H H H
charge: -0.070564 -0.118273 -0.371823 -0.401913 -0.368856 -0.338975 -0.381365 -0.370826 -0.317965 -0.351080 -0.344404 -0.571101 -0.359211 -0.676323 0.526148 -0.693502 -0.391224 -0.415039 -0.218639 -0.215737 -0.108857 0.196483 0.197540 0.194330 0.192314 0.196464 0.196368 0.172984 0.212530 0.189527 0.195309 0.187888 0.183562 0.184735 0.207277 0.230641 0.202185 0.179651 0.185728 0.202999 0.204783 0.196076 0.194865 0.207493 0.224617 0.207198 0.206625 0.210436 0.216739 0.242296 0.237827 0.250859 0.251198
chargesum: 0.00000
title: Mulliken charges with hydrogens summed into heavy atoms:
elementType: Cl N C C C C C C C C C C C C C C C C C C C
charge: -0.070564 -0.118273 0.022200 -0.015268 0.023976 0.046539 0.003472 0.000624 0.074047 0.081746 0.020975 -0.163319 0.031730 -0.037015 0.526148 -0.059702 -0.148928 -0.177213 0.032221 0.035461 -0.108857
polarizability: 2.64575741e+02 8.04972188e+00 2.25925329e+02 2.25529080e+01 1.14076914e+01 1.75870119e+02
1716.lowfreq: -15.3120 -6.8046 -0.0020 -0.0019 0.0009 1.7522 7.1052 13.9155 23.1087
frequency: -12.6905 13.6124 22.7684 27.4129 30.4818 32.1827 48.4154 62.9396 66.2253 92.0553 106.5055 108.7290 128.7276 135.2072 142.4878 196.9936 212.5426 223.7607 225.8299 236.7465 242.0649 256.7398 287.8104 310.9926 321.2692 356.1910 366.6325 398.0203 402.8973 408.3302 421.8343 452.9635 498.9370 528.0100 537.8744 627.3084 638.1421 691.2772 716.1964 723.9931 739.4113 752.0864 786.1285 799.0797 799.8262 826.9865 829.0757 835.7238 854.3765 868.4320 885.8831 894.6933 935.3414 947.5443 954.2671 965.3773 994.8569 999.3430 1004.5824 1021.6026 1038.3749 1048.9890 1057.2002 1062.3950 1071.4695 1078.0361 1082.8001 1087.9700 1096.7797 1100.5334 1109.2889 1121.3014 1130.3970 1173.4728 1182.2819 1195.1629 1197.6852 1215.8771 1228.1544 1233.1112 1250.2683 1260.3183 1266.4797 1274.8437 1279.1300 1281.5543 1287.6607 1288.0958 1294.1959 1296.8014 1297.8193 1320.7915 1331.7284 1349.1314 1351.3772 1353.8551 1359.7108 1365.6532 1375.2909 1376.5772 1387.2437 1387.5438 1394.7348 1454.9966 1456.9894 1461.2865 1461.7703 1464.3764 1468.1919 1472.1343 1473.3850 1474.6976 1476.5472 1477.6416 1479.8800 1481.8606 1485.7501 1487.6561 1489.9035 1587.0413 1600.0020 2845.7831 2853.2747 2865.5419 2943.5957 2948.8749 2955.1828 2964.6681 2965.5054 2967.6965 2969.4616 2970.4257 2979.1175 2982.1892 2983.0795 2999.8892 3006.2582 3008.7731 3020.1708 3020.9937 3025.6434 3028.6388 3033.8800 3042.7783 3055.8861 3065.7998 3071.0997 3076.2106 3089.2810 3126.3219 3128.6284 3164.3526 3168.8085
redmass: 3.0979 3.9226 4.2958 4.2080 2.8122 2.5402 3.1617 3.2304 3.8173 1.8718 1.8160 2.9777 1.9182 2.5315 3.4104 1.4523 2.4475 2.7484 1.2846 4.3241 3.3709 2.8263 2.0019 2.4869 3.0274 2.7116 3.4568 2.5420 4.9857 2.9064 2.7256 2.5694 3.0623 2.5636 2.7199 6.8967 5.3096 1.9923 3.5569 1.0725 1.1307 1.2215 1.2407 1.5041 2.0273 1.8044 1.2830 1.4309 1.9078 1.5683 1.5751 1.7262 1.7684 1.4575 1.6098 1.3680 1.3280 4.3609 3.6942 3.0723 2.4119 2.3056 1.8578 2.7788 2.6947 2.0638 2.1445 2.0506 1.9831 2.1167 1.5110 2.3098 1.2463 1.9937 1.1350 1.5639 1.8928 2.4513 1.3907 1.3886 1.3733 1.3055 1.3179 1.1228 1.1667 1.0906 1.2127 1.1280 1.2277 1.2468 1.2714 1.3952 1.4102 1.5700 1.6452 1.5855 1.3308 1.3194 1.4550 5.2380 1.2375 1.2170 2.6570 1.0772 1.0852 1.0579 1.0697 1.0781 1.1069 1.0865 1.0844 1.0935 1.0498 2.0182 1.0912 1.0866 1.0933 1.0957 1.0776 7.3181 6.3459 1.0720 1.0715 1.0706 1.0587 1.0613 1.0613 1.0599 1.0599 1.0580 1.0602 1.0375 1.0625 1.0964 1.0362 1.0944 1.0986 1.0945 1.0937 1.0992 1.0953 1.0929 1.0908 1.1020 1.1023 1.1006 1.0993 1.0983 1.1004 1.0896 1.0896 1.0951 1.0958
irintensity: 0.0382 0.0494 0.0203 0.0229 0.0419 0.0260 0.0307 0.0131 0.3119 0.1513 0.0860 0.0612 0.2227 0.0633 0.0919 0.4690 0.7477 0.5134 0.0837 0.1554 0.0728 0.1481 2.8956 0.4360 1.1428 0.3661 6.2424 2.2148 6.8138 0.0405 0.4669 1.6376 14.6244 9.0762 9.0350 0.0289 19.6725 7.6430 4.1205 11.7684 0.9154 5.6793 2.2403 12.5610 14.1425 32.0383 3.1941 6.4186 0.9164 9.4292 2.4812 6.8862 1.1974 0.2530 1.0929 0.1607 4.5669 33.4112 3.1212 4.0599 2.9249 16.3138 1.0957 11.9705 32.4633 5.4290 3.8704 14.8177 16.1915 17.1679 5.0015 5.4649 13.2656 17.6140 1.9546 5.4638 21.1841 1.4109 15.1844 13.0270 4.9677 3.8809 6.1875 1.8508 2.2188 0.8685 4.4807 3.8513 9.1039 7.5216 4.0353 2.3001 1.4552 1.2713 0.5522 2.0135 6.5214 5.2745 0.7451 0.0400 19.2355 9.8751 4.8353 2.2538 2.3035 4.7644 0.9258 0.1365 4.9189 2.8284 8.1345 2.1064 10.2774 87.2773 12.9521 1.6815 15.0281 33.5950 9.8816 1.3907 4.0094 50.9876 28.9934 300.2457 15.2979 1.8063 39.8958 28.6782 20.7006 176.9130 8.6468 24.3083 60.5232 1.6203 36.2402 7.1442 7.0959 15.7038 25.4162 6.5192 4.9380 29.0191 22.7335 155.3309 70.1056 99.3275 58.3899 62.0449 44.4992 11.5833 12.3674 8.0907 2.1140
temp: 298.150 k
press: 1.00000 atm
elementType: 17 7 6 6 6 6 6 6 6 6 6 6 6 6 6 6 6 6 6 6 6 1 1 1 1 1 1 1 1 1 1 1 1 1 1 1 1 1 1 1 1 1 1 1 1 1 1 1 1 1 1 1 1
symmnumber: 1
zpe: 1226290.3 jmol-1
zpe.correction: 0.467069 hartree
zpe.thermalcorrener: 0.491258 hartree
zpe.thermalcorrenthalpy: 0.492202 hartree
zpe.thermalcorrgfe: 0.408909 hartree
zpe.sumelectzpe: -1256.348960 hartree
zpe.sumelectthermal: -1256.324772 hartree
zpe.sumelectthermalent: -1256.323828 hartree
zpe.sumelectthermalfe: -1256.407121 hartree
dipole: -3.6467 -0.9114 -1.0384
dipole: 3.8996
quadrupole: -150.0260 -130.0940 -139.0826
quadrupole: -0.9974 -2.7963 2.3373
quadrupole: -10.2918 9.6402 0.6516 -0.9974 -2.7963 2.3373
hfenergy: -1256.8160296 hartree
pointgroup: C01 [X(C19H32Cl1N1)]
dipole: -1.0446851 -0.9527683 -0.5955748 debye
polarizability: 242.1183769|16.7245816|240.7945217|29.0166417|20.9332429|183.4582903 unknown
InChI: InChI=1S/C19H32ClN/c1-3-5-6-7-9-16-21(4-2)17-10-8-11-18-12-14-19(20)15-13-18/h12-15H,3-11,16-17H2,1-2H3
charge 0 multiplicity 1
53 atoms
Cl 5.013744 2.458051 2.391009
N  -2.562562 -2.421908 0.196481
C  -3.512514 -1.928314 -0.83827
C  -3.92909 -0.452988 -0.63033
C  -1.633467 -3.462382 -0.320239
C  -2.747645 0.529717 -0.775963
C  -0.461568 -2.867557 -1.136435
C  -3.12184 2.002485 -0.499777
C  -3.248182 -2.814465 1.456594
C  0.482263 -1.996942 -0.280789
C  -1.909996 2.957279 -0.597195
C  1.526461 -1.225234 -1.134543
C  -2.26318 4.439283 -0.336834
C  -2.32775 -2.754376 2.691001
C  2.404908 -0.310267 -0.295741
C  -1.035357 5.37226 -0.416581
C  1.955385 0.985173 0.071973
C  3.672343 -0.736829 0.176915
C  2.738097 1.833765 0.886276
C  4.473057 0.093876 0.994519
C  3.988667 1.369815 1.337138
H  -4.425264 -2.574494 -0.885928
H  -3.019504 -2.012332 -1.825547
H  -4.721705 -0.205314 -1.367102
H  -4.386876 -0.32928 0.372465
H  -2.175548 -4.218575 -0.942796
H  -1.214305 -4.011189 0.543964
H  -2.327327 0.446206 -1.801525
H  -1.947115 0.209301 -0.080502
H  -0.864289 -2.256549 -1.970329
H  0.104946 -3.699271 -1.604673
H  -3.570409 2.083844 0.512634
H  -3.906073 2.330119 -1.214543
H  -3.703275 -3.835071 1.372546
H  -4.087959 -2.111999 1.611698
H  -0.13123 -1.279199 0.295532
H  1.010694 -2.629516 0.461538
H  -1.13676 2.635549 0.133452
H  -1.447976 2.864197 -1.6030
H  2.152111 -1.953036 -1.688007
H  0.980173 -0.630203 -1.893605
H  -2.736074 4.53067 0.66231
H  -3.026342 4.765997 -1.072557
H  -1.476119 -3.453246 2.606189
H  -1.918752 -1.735839 2.810653
H  -2.889687 -3.02163 3.605499
H  -0.273205 5.088729 0.334351
H  -0.559434 5.316075 -1.413906
H  -1.312621 6.426653 -0.233236
H  0.981618 1.341814 -0.285727
H  4.045613 -1.730896 -0.097298
H  2.385401 2.832816 1.159573
H  5.45072 -0.242579 1.35207
