program: Gaussian 09
title: 000194429
version: EM64L-G09RevD.01
frameworkgroup: C1[X(C16H29N3O6)]
method: RPBEPBE
basis: SDD
operation: Freq
keyword: #p
keyword: freq=noraman
keyword: PBEPBE/SDD
title: #p freq=noraman PBEPBE/SDD
converged: NO YES NO NO
title: Mulliken charges:
elementType: O O O O O O N N N C C C C C C C C C C C C C C C C H H H H H H H H H H H H H H H H H H H H H H H H H H H H H
charge: -0.319684 -0.220280 -0.232797 -0.258157 -0.256357 -0.337026 -0.230660 -0.558736 -0.368494 0.171078 -0.195313 0.213332 -0.216348 0.248345 -0.763737 -0.699852 0.337145 -0.703270 -0.708464 0.315711 -0.709547 -0.703956 -0.714843 0.349212 -0.511891 0.305872 0.269344 0.257050 0.198964 0.249688 0.262741 0.217932 0.230361 0.208466 0.247126 0.253087 0.260439 0.285924 0.332492 0.235664 0.222052 0.243324 0.220467 0.266785 0.209448 0.227920 0.232974 0.203671 0.206475 0.244145 0.255748 0.250638 0.243783 0.232012
chargesum: 0.00000
title: Mulliken charges with hydrogens summed into heavy atoms:
elementType: O O O O O O N N N C C C C C C C C C C C C C C C C
charge: -0.319684 -0.220280 -0.232797 -0.258157 -0.256357 -0.337026 -0.230660 -0.012372 -0.036002 0.171078 0.110559 0.213332 0.052996 0.248345 -0.058035 0.011183 0.337145 0.005408 -0.007425 0.315711 -0.012847 -0.039392 -0.008475 0.349212 0.214542
polarizability: 2.55681722e+02 -1.03071326e+01 2.21821128e+02 2.32006149e+00 4.63514816e+00 1.79905655e+02
1716.lowfreq: -6.4847 -4.2672 -0.0004 -0.0004 0.0003 3.7731 18.0069 26.8714 35.4986
frequency: 17.8843 26.5173 35.4244 43.7774 46.7238 48.6005 59.2543 80.0564 88.7174 104.3870 114.1753 120.2529 128.5110 142.5968 161.2675 170.6970 178.3462 185.0480 195.7581 202.6021 217.6472 220.3221 226.7988 232.5785 240.0669 243.6754 248.4856 260.2371 267.6208 299.1645 302.0369 309.3360 311.2429 329.1143 333.6830 341.9275 356.0724 363.9425 403.6744 406.7339 417.8269 434.5837 438.2831 479.1580 494.6347 504.9148 529.2895 576.2937 594.5285 613.5673 675.0541 693.4614 699.5196 705.3841 712.9813 732.4134 749.0753 759.5390 799.0092 814.6544 826.8969 860.8507 902.6120 917.8415 922.7978 938.4382 944.0431 957.3959 959.9979 984.6283 1002.5314 1004.8967 1029.7212 1032.0707 1036.8947 1049.4944 1056.8176 1075.3837 1101.2541 1114.3907 1119.9765 1130.0078 1150.8610 1152.3491 1164.5069 1191.8326 1207.8638 1216.3018 1228.3449 1245.4955 1256.9865 1272.3881 1297.3157 1311.9531 1313.2626 1327.9074 1367.2377 1377.3638 1380.4803 1383.7771 1386.5480 1391.3351 1393.8425 1403.2615 1420.8622 1445.0261 1452.2351 1459.0581 1461.0463 1461.6213 1463.6760 1466.4972 1467.7321 1468.8641 1469.5492 1470.8749 1480.7033 1481.5019 1483.9559 1486.2115 1491.2063 1502.9660 1566.6223 1594.6408 1613.3910 1628.0651 1646.9139 2986.9235 2989.3314 2991.2851 2994.2042 2994.9234 2996.2824 2999.3985 3004.0646 3004.8839 3071.5724 3082.4736 3083.2593 3086.2173 3089.7249 3094.7920 3098.3529 3100.1761 3101.8454 3108.2124 3110.1024 3110.5036 3113.9792 3123.6158 3129.4917 3136.7569 3150.1435 3410.4489 3537.1355 3556.8356
redmass: 4.3333 4.6053 3.7689 4.1130 4.7122 3.6521 4.2914 3.6674 4.9131 1.2375 4.2744 3.9080 4.2298 4.0620 2.7610 2.1610 1.0860 3.1466 2.5673 1.7156 1.5599 2.7114 1.7550 1.2744 1.0851 1.5137 1.1500 2.0611 2.2257 1.3358 2.9149 3.6096 3.6992 4.3030 2.7465 2.9753 3.6651 4.7754 4.2097 2.9501 2.7293 2.8928 2.9409 3.0120 3.5962 4.9390 4.5135 3.7253 1.2541 3.9009 5.2265 5.5013 4.3613 6.9029 2.4022 5.2134 4.0356 6.1146 4.3791 3.2364 3.1066 2.7132 2.0811 1.5925 1.6434 4.9288 1.4929 1.2107 3.5964 1.5664 1.3879 3.7746 2.1809 1.4207 1.4264 1.7232 1.6287 2.0579 3.0119 1.2814 2.8783 4.0706 1.4806 3.0889 2.2794 2.6464 4.3244 2.2673 2.8383 3.4815 3.0215 2.9590 1.4425 2.1768 1.4107 1.3780 1.2016 1.2243 1.2325 1.2136 1.2238 1.2367 1.2691 1.2190 1.1888 1.0466 1.0501 1.0534 1.0488 1.0521 1.0562 1.2149 1.0673 1.1149 1.0670 1.0906 1.0532 1.0602 1.0564 1.3260 1.0552 1.0696 10.4286 8.5395 7.9940 10.1217 1.0924 1.0416 1.0358 1.0357 1.0361 1.0353 1.0368 1.0814 1.0370 1.0306 1.0862 1.0952 1.0993 1.0993 1.0987 1.0986 1.0992 1.1006 1.0983 1.1045 1.1006 1.1008 1.0999 1.1003 1.0993 1.0971 1.1049 1.0449 1.0956 1.0772
irintensity: 0.5499 0.6394 0.9382 1.6682 3.1807 1.6945 0.6778 2.1888 5.7568 0.5437 5.0652 1.5469 1.2213 3.4157 2.6641 0.0094 0.7648 1.3117 0.4179 1.3932 5.3478 8.8031 4.0757 1.5194 0.1494 5.3457 0.5834 9.2837 3.3470 30.7722 11.1622 16.5214 3.7430 13.3230 1.2687 9.4794 13.4663 20.3331 3.4216 0.7771 19.1573 4.0884 7.4039 4.7166 6.1076 9.8652 17.2682 0.2911 146.0463 6.2635 0.4535 39.5076 34.4978 11.2048 176.2418 63.2093 37.6018 24.9666 5.8282 14.0711 9.5932 20.4495 0.2093 0.6641 1.5867 13.4641 1.6508 0.7281 27.5193 29.4546 25.1022 134.5856 90.5049 1.5206 4.4815 128.7668 13.5957 91.2428 12.4614 1.1040 9.8217 189.5078 17.3343 150.6974 295.0515 4.0445 181.1784 156.9159 32.7857 125.4211 34.9238 22.7029 7.2245 6.0343 72.6714 21.8282 32.6499 40.2781 42.5965 14.1948 55.4177 21.8316 53.5115 30.4809 15.1341 1.2954 9.7595 4.6486 10.8585 18.3255 6.5536 124.0313 6.8115 68.5730 17.8031 22.1414 8.9691 18.7882 16.2496 111.0363 17.3002 66.8495 116.0244 142.3145 144.7233 212.6007 45.7308 29.8749 19.6759 12.4998 21.4582 20.2623 34.1411 52.5790 31.6321 22.6364 2.5571 20.8442 9.2171 19.1508 28.4940 33.6782 51.4780 26.7454 17.9574 21.7671 7.1522 11.6187 20.6120 8.6325 2.0190 9.7481 16.2470 4.3115 1.4236 39.2207
temp: 298.150 k
press: 1.00000 atm
elementType: 8 8 8 8 8 8 7 7 7 6 6 6 6 6 6 6 6 6 6 6 6 6 6 6 6 1 1 1 1 1 1 1 1 1 1 1 1 1 1 1 1 1 1 1 1 1 1 1 1 1 1 1 1 1
symmnumber: 1
zpe: 1170064.1 jmol-1
zpe.correction: 0.445654 hartree
zpe.thermalcorrener: 0.476106 hartree
zpe.thermalcorrenthalpy: 0.477050 hartree
zpe.thermalcorrgfe: 0.384117 hartree
zpe.sumelectzpe: -1240.738564 hartree
zpe.sumelectthermal: -1240.708113 hartree
zpe.sumelectthermalent: -1240.707168 hartree
zpe.sumelectthermalfe: -1240.800101 hartree
dipole: -2.3924 0.2342 2.0979
dipole: 3.1905
quadrupole: -146.8523 -138.5563 -153.3291
quadrupole: -3.4504 11.2966 -3.4345
quadrupole: -0.6063 7.6896 -7.0832 -3.4504 11.2966 -3.4345
hfenergy: -1241.1842181 hartree
pointgroup: C01 [X(C16H29N3O6)]
dipole: 0.9698756 0.0818523 0.7926579 debye
polarizability: 256.1693854|-9.8580644|218.3442077|-2.9136617|-11.2065031|182.894911 unknown
InChI: InChI=1S/C16H29N3O6/c1-9(18-14(23)25-15(3,4)5)11(20)19(10(2)12(21)24-8)13(22)16(6,7)17/h9-10,18H,17H2,1-8H3
charge 0 multiplicity 1
54 atoms
O  3.39814 1.145532 -0.770495
O  -2.565135 -1.788379 0.091301
O  -1.554171 1.780509 -1.250417
O  0.262568 -2.898807 1.216954
O  0.481762 -1.593485 -0.697479
O  2.413609 0.724447 1.348949
N  -1.443039 0.201433 0.476531
N  -5.07819 -0.676774 0.313166
N  1.35926 2.001426 -0.306919
C  -4.004083 0.163369 -0.278432
C  -0.502176 -0.596277 1.338631
C  -2.622727 -0.528448 0.050051
C  0.120135 2.234625 0.451943
C  -1.023547 1.385606 -0.175311
C  -4.167651 1.581489 0.312725
C  -4.193394 0.155493 -1.816608
C  4.606221 0.238777 -0.545122
C  -1.143702 -1.026702 2.667387
C  -0.282389 3.723418 0.413841
C  0.090361 -1.734508 0.483338
C  5.439744 0.792339 0.627068
C  5.347813 0.373207 -1.885933
C  4.12293 -1.205775 -0.305961
C  2.397591 1.236826 0.189533
C  0.87667 -4.02768 0.47636
H  0.376229 0.037782 1.563593
H  0.32588 1.941037 1.492986
H  -3.531579 2.31779 -0.197617
H  -3.943852 1.599004 1.397103
H  -5.222074 1.875688 0.177348
H  -3.41969 0.763761 -2.308786
H  -4.138521 -0.878291 -2.20435
H  -5.194933 0.560664 -2.042104
H  -1.507614 -0.136023 3.210575
H  -0.390087 -1.533398 3.291046
H  -1.977745 -1.727666 2.510418
H  -5.109266 -0.618327 1.34011
H  -5.006891 -1.657057 0.00993
H  1.394784 2.282732 -1.288785
H  0.541423 4.338107 0.814436
H  -1.185016 3.898877 1.026239
H  -0.508143 4.037811 -0.61916
H  5.730509 1.840159 0.434097
H  4.871446 0.743796 1.569325
H  6.362052 0.192939 0.737633
H  5.600779 1.42884 -2.084686
H  4.721991 0.001303 -2.715108
H  6.283159 -0.213735 -1.85814
H  4.989637 -1.89065 -0.34794
H  3.399585 -1.503811 -1.085265
H  3.640742 -1.300965 0.679722
H  0.227644 -4.317082 -0.366615
H  1.869108 -3.737334 0.091891
H  0.955145 -4.837413 1.2150
