program: Gaussian 09
title: 000194405
version: EM64L-G09RevD.01
frameworkgroup: C1[X(C19H21N5O4)]
method: RPBEPBE
basis: SDD
operation: Freq
keyword: #p
keyword: freq=noraman
keyword: PBEPBE/SDD
title: #p freq=noraman PBEPBE/SDD
converged: YES YES NO NO
title: Mulliken charges:
elementType: O O O O N N N N N C C C C C C C C C C C C C C C C C C C H H H H H H H H H H H H H H H H H H H H H
charge: -0.286854 -0.450368 -0.467615 -0.438227 -0.163578 -0.045464 -0.069773 -0.232971 -0.091225 -0.142666 -0.047216 -0.254027 -0.039384 -0.337274 0.147416 -0.226321 -0.096688 0.166123 -0.404574 -0.448640 0.474468 -0.339983 -0.380156 -0.026906 -0.209025 -0.206039 -0.239201 -0.565423 0.252190 0.250562 0.300328 0.258666 0.208293 0.219460 0.368569 0.366010 0.274368 0.354089 0.242651 0.251471 0.218588 0.245600 0.244247 0.250803 0.227436 0.226591 0.228734 0.217084 0.215848
chargesum: 0.00000
title: Mulliken charges with hydrogens summed into heavy atoms:
elementType: O O O O N N N N N C C C C C C C C C C C C C C C C C C C
charge: -0.286854 -0.081799 -0.101604 -0.084138 -0.163578 -0.045464 -0.069773 -0.232971 -0.091225 0.109525 0.203346 0.046301 0.219282 0.090479 0.147416 0.048047 -0.096688 0.166123 -0.161923 0.021419 0.474468 -0.094383 -0.135909 0.223897 0.018412 0.020552 -0.010467 -0.132490
polarizability: 3.40911991e+02 1.42227879e+01 2.45771522e+02 -8.08619372e+00 -7.93791348e+00 1.87032995e+02
1716.lowfreq: -11.1865 -9.5491 -0.0009 -0.0005 -0.0003 1.4374 8.9404 13.7953 25.2738
frequency: 4.7682 13.0137 25.1404 27.8179 40.1886 47.0478 52.1019 63.7088 76.8498 90.1102 99.2220 108.9438 142.4822 173.3957 177.0860 213.7734 227.4547 245.3257 267.3796 274.1038 284.7016 292.9017 304.1472 308.5307 333.9927 365.9205 370.3762 394.6184 405.9677 450.2576 453.8960 462.3793 501.3723 508.6692 532.6840 556.8315 559.4359 570.3152 578.9541 613.9251 634.4815 644.8647 661.0185 668.8750 678.7945 693.1061 698.1121 728.1213 773.9245 785.1801 801.3127 803.1780 813.8403 823.8044 840.4060 862.1993 875.8246 900.8370 919.1582 921.9842 928.9358 948.0686 953.7780 970.7297 972.2906 973.2337 989.2587 990.2791 993.0936 1011.7008 1014.4214 1018.5142 1024.7978 1038.7305 1058.0960 1066.2791 1078.5535 1104.5523 1124.2310 1140.1131 1159.4175 1170.3562 1171.9149 1179.1931 1182.4495 1202.0277 1213.9414 1225.6946 1250.7008 1261.8550 1264.6492 1271.6083 1275.8443 1287.3230 1293.4210 1300.5233 1309.1644 1311.2696 1332.2397 1337.7711 1341.7614 1350.2119 1370.6822 1379.5932 1382.0628 1386.9545 1394.9078 1396.9350 1419.4045 1429.5224 1438.3870 1442.5032 1460.0041 1464.9969 1485.4259 1528.0805 1564.7092 1595.6016 1610.2466 1657.4930 2965.5386 3020.4888 3020.6581 3024.8378 3054.5846 3057.1778 3076.6095 3085.8997 3087.5331 3120.0195 3127.2638 3134.8177 3146.7446 3154.3605 3156.1122 3168.8356 3195.7849 3227.9819 3413.6360 3548.1710 3593.0325
redmass: 6.0862 5.7551 4.2296 4.5235 4.8495 5.6728 4.8457 4.3612 5.0079 4.1999 3.5728 5.0604 5.2568 4.7551 4.3112 7.2927 3.4684 2.2926 5.6694 4.4566 3.2341 5.7691 2.6451 2.7570 5.1379 2.9047 2.7637 4.6569 2.8322 2.9548 1.3072 3.2614 4.4432 3.5641 3.6684 3.6144 4.0840 4.2104 1.2612 6.3537 4.7492 5.3709 4.6998 7.4725 3.2326 3.1929 1.9921 5.7817 1.9075 5.1829 4.4635 3.8793 4.5499 1.7523 1.2492 5.3211 3.5435 1.7682 1.4853 3.8603 1.4328 2.5259 1.4802 1.7032 2.8257 2.8421 3.6094 3.5348 1.5078 3.3759 1.1975 2.5164 2.0116 3.5098 5.0337 3.9060 1.5743 2.0586 5.1327 2.1237 1.6626 2.1449 1.0693 1.1165 1.2429 1.9165 1.3041 2.4217 1.9882 1.6702 1.3011 1.6160 1.3135 1.4217 2.2865 1.4284 1.3433 1.3927 3.1231 1.3372 1.3965 1.6732 1.9618 7.8261 1.2741 1.4791 2.0760 1.9575 1.7489 1.4660 2.2499 1.4538 1.0863 2.8070 2.7963 7.5601 9.7795 6.5439 6.2904 4.6133 1.0669 1.0737 1.0710 1.0849 1.0865 1.0881 1.0974 1.0879 1.0754 1.0957 1.0847 1.0882 1.0929 1.0917 1.0970 1.1017 1.1143 1.0985 1.0643 1.0656 1.0669
irintensity: 0.1008 0.7300 0.5570 0.1855 0.2510 0.8515 0.2748 0.5766 8.9185 7.3075 1.3836 0.0548 1.0637 1.6880 0.5066 2.2791 2.3499 35.4363 5.8239 2.5008 0.2445 3.7819 3.2279 28.3562 5.4019 9.8603 5.4110 2.8769 0.1023 15.3760 116.7328 5.2367 14.6301 1.7170 23.5475 12.0652 8.9938 2.7005 120.8919 0.5073 3.5906 21.0791 17.5692 0.8697 19.5589 18.7463 46.2883 108.3081 19.3527 13.5027 30.2634 73.0959 59.5247 12.2135 0.2609 6.6839 20.9485 19.7370 2.2452 131.7077 14.6514 17.1388 77.9593 5.5535 65.9781 60.1379 130.1490 15.7920 0.3682 63.1597 22.3898 23.7295 13.3134 27.9879 34.9373 9.8704 13.4795 13.3683 1.7300 8.5076 48.5801 9.3665 0.3370 1.3202 22.6794 141.0666 6.4050 15.1386 49.7980 64.1945 7.4368 11.8346 9.3649 15.8744 23.3910 41.5808 1.5054 38.0801 165.9677 21.7313 5.4645 26.9366 148.6464 1.0966 24.8255 5.9630 3.0397 25.4239 89.1045 4.8312 4.8170 47.2257 4.9833 14.6412 57.9737 63.0831 849.8369 8.3846 7.7147 13.8981 38.6508 85.1399 1.6791 17.1110 11.7039 7.0753 35.0267 2.3654 12.7979 5.3256 1.5675 2.4068 25.5674 20.8167 28.2185 13.9912 23.0764 0.0871 65.7340 7.8821 23.1958
temp: 298.150 k
press: 1.00000 atm
elementType: 8 8 8 8 7 7 7 7 7 6 6 6 6 6 6 6 6 6 6 6 6 6 6 6 6 6 6 6 1 1 1 1 1 1 1 1 1 1 1 1 1 1 1 1 1 1 1 1 1
symmnumber: 1
zpe: 1002646.5 jmol-1
zpe.correction: 0.381888 hartree
zpe.thermalcorrener: 0.407554 hartree
zpe.thermalcorrenthalpy: 0.408498 hartree
zpe.thermalcorrgfe: 0.320927 hartree
zpe.sumelectzpe: -1309.174065 hartree
zpe.sumelectthermal: -1309.148399 hartree
zpe.sumelectthermalent: -1309.147455 hartree
zpe.sumelectthermalfe: -1309.235026 hartree
dipole: -2.1225 0.8732 -2.7472
dipole: 3.5797
quadrupole: -156.1512 -158.9825 -166.4428
quadrupole: 13.1793 -15.8654 -8.4713
quadrupole: 4.3743 1.5430 -5.9173 13.1793 -15.8654 -8.4713
hfenergy: -1309.5559525 hartree
pointgroup: C01 [X(C19H21N5O4)]
dipole: -0.9339548 -0.915588 0.5224418 debye
polarizability: 334.2420374|-28.6850523|227.2059069|-8.5047646|32.2397566|212.2685634 unknown
InChI: InChI=1S/C19H21N5O4/c1-2-8-23(12-6-4-3-5-7-12)17-14-18(21-10-20-17)24(11-22-14)19-16(27)15(26)13(9-25)28-19/h2-7,10-11,13,15-16,19,25-27H,1,8-9H2
charge 0 multiplicity 1
49 atoms
O  3.712903 1.142836 -0.293534
O  5.02678 -0.643879 2.001099
O  5.706504 -1.870561 -0.250089
O  4.391681 1.58289 -3.030097
N  1.727083 0.492701 0.91431
N  -0.424247 1.185678 1.330268
N  1.260783 -1.40867 -0.616114
N  -2.842285 -0.411538 -0.022301
N  -1.140733 -1.730298 -0.981065
C  3.892077 -0.833453 1.104317
C  3.193951 0.538769 0.946575
C  4.403781 -1.184498 -0.329143
C  4.614661 0.184897 -1.004042
C  4.234695 0.233271 -2.486052
C  0.892497 -0.354595 0.172822
C  0.874831 1.396244 1.576822
C  -0.439167 0.087794 0.442491
C  -1.495493 -0.656744 -0.183762
C  0.172518 -2.042314 -1.146435
C  -3.839781 -1.34834 -0.634575
C  -3.35583 0.813342 0.559761
C  -3.178833 2.047482 -0.106305
C  -4.087345 0.754326 1.768214
C  -4.168368 -0.983016 -2.069297
C  -3.720041 3.226469 0.448784
C  -4.63337 1.935424 2.316225
C  -4.449209 3.174369 1.659229
C  -5.391654 -0.579137 -2.491477
H  3.206544 -1.601873 1.506512
H  3.476709 1.183897 1.796504
H  3.640909 -1.784777 -0.853727
H  5.657464 0.523495 -0.855696
H  3.1928 -0.132395 -2.606325
H  4.919077 -0.404503 -3.071406
H  5.797503 -1.120698 1.577814
H  5.57908 -2.847608 -0.333827
H  1.267521 2.179423 2.222518
H  3.872044 2.195724 -2.44789
H  0.379386 -2.904773 -1.787828
H  -3.402373 -2.360683 -0.599788
H  -4.748073 -1.316306 -0.008415
H  -2.620546 2.078338 -1.047692
H  -4.203876 -0.205628 2.283526
H  -3.332845 -1.076175 -2.776423
H  -3.577088 4.183076 -0.065651
H  -5.191468 1.890333 3.257931
H  -4.870131 4.090916 2.087165
H  -5.586321 -0.33827 -3.542658
H  -6.236404 -0.479061 -1.797974
