program: Gaussian 09
title: 000017873
version: EM64L-G09RevD.01
frameworkgroup: C1[X(C25H16)]
method: RPBEPBE
basis: SDD
operation: Freq
keyword: #p
keyword: freq=noraman
keyword: PBEPBE/SDD
title: #p freq=noraman PBEPBE/SDD
converged: YES YES NO NO
title: Mulliken charges:
elementType: C C C C C C C C C C C C C C C C C C C C C C C C C H H H H H H H H H H H H H H H H
charge: -0.058955 -0.126554 0.425762 0.282084 0.295856 0.110356 0.244974 0.479067 0.195137 -0.897861 0.576236 -0.450484 -0.514682 -0.395407 -0.631187 -0.361981 -0.472921 0.482245 -0.289541 -0.361487 -0.416686 -0.494484 -0.259148 -0.254191 -0.818701 0.232757 0.223249 0.235960 0.232483 0.233160 0.229833 0.244027 0.229574 0.224072 0.234478 0.248797 0.227709 0.230217 0.231001 0.230045 0.225195
chargesum: 0.00000
title: Mulliken charges with hydrogens summed into heavy atoms:
elementType: C C C C C C C C C C C C C C C C C C C C C C C C C
charge: -0.058955 -0.126554 0.425762 0.282084 0.295856 0.110356 0.244974 0.479067 0.195137 -0.665104 0.576236 -0.227235 -0.278722 -0.162924 -0.398027 -0.132148 -0.228894 0.482245 -0.059967 -0.137415 -0.182207 -0.245688 -0.031440 -0.023974 -0.132461
polarizability: 4.71609993e+02 2.78897985e+01 3.64836094e+02 4.20008434e-02 6.44165046e-03 1.03432494e+02
1716.lowfreq: -0.0008 -0.0001 0.0004 5.6623 13.5326 14.8169 31.8220 48.0659 53.8306
frequency: 31.1526 47.9851 53.8164 88.9648 105.5091 153.8336 159.2413 194.1861 226.8636 233.3302 261.6692 292.2146 310.7254 319.3320 341.5330 360.8321 413.1162 435.5751 438.0133 446.3763 467.1475 493.0471 518.9690 541.6428 549.8865 556.5387 569.9424 575.1638 597.8411 602.5475 629.8917 662.5883 670.2518 691.2453 723.1423 729.5319 756.9524 769.0216 782.9064 798.2910 824.3867 828.8939 838.7826 860.4943 876.5214 881.0328 883.6226 903.0074 913.2493 929.1356 961.0948 963.9925 968.7424 976.0294 986.2498 990.5904 1012.0715 1016.4427 1039.3960 1040.1931 1050.9890 1074.4362 1084.0857 1104.9358 1139.6883 1170.0237 1177.1426 1189.0476 1191.5024 1230.3889 1236.0580 1240.7832 1267.8034 1277.1307 1299.3057 1318.4161 1322.8710 1333.1729 1376.2894 1384.3163 1397.9960 1398.2376 1407.2635 1420.3720 1427.7157 1435.6148 1439.5353 1455.6971 1468.5389 1478.2839 1482.9294 1494.3122 1519.9782 1528.1757 1570.2345 1579.0620 1599.3261 1603.5360 1622.8315 1626.0780 1631.0724 2975.5004 3052.8463 3083.8995 3120.1364 3123.1235 3125.1432 3127.7030 3133.3152 3139.9521 3142.9821 3149.0095 3149.9690 3161.4377 3162.1931 3167.8021 3169.4349
redmass: 1.0403 4.2059 4.2483 3.7919 4.3740 4.2772 4.3180 3.7053 4.1762 3.9759 4.0599 5.3749 4.1612 6.6677 3.8028 4.3374 5.8254 4.0480 3.0153 4.7733 3.2387 5.1751 3.0380 6.4744 6.2400 3.3721 3.1297 7.2874 5.4231 3.3805 6.1178 6.8918 3.4625 6.0253 2.4727 6.1352 1.5735 1.9734 1.4247 1.7949 5.8235 1.5604 5.8453 1.5261 1.8109 1.6300 6.2343 5.2146 1.4383 2.4379 1.4313 2.5912 1.3626 1.3962 1.3972 1.3580 1.9007 5.4229 2.2420 4.4033 1.8202 3.0297 2.8936 2.1313 1.6245 1.2763 1.1044 1.4110 1.5035 1.6925 1.7251 1.8079 1.8412 1.8060 2.5223 2.8640 2.0705 2.6067 2.8677 4.4435 2.5677 1.5468 5.5823 3.9895 3.1326 3.7421 3.3092 2.1884 1.0461 2.3470 1.6870 3.1687 4.4239 3.7098 5.4953 7.4925 5.9920 6.1576 5.8697 7.1533 6.5256 1.0373 1.0974 1.0987 1.0867 1.0886 1.0872 1.0874 1.0887 1.0915 1.0915 1.0927 1.0944 1.0930 1.0973 1.0946 1.0949
irintensity: 0.4449 0.0102 0.7214 0.0376 2.0804 0.4316 0.1669 1.2703 0.0669 0.0125 3.4994 0.6056 0.6860 0.0844 1.4465 0.6005 0.2848 0.0023 0.0222 0.3210 7.2996 2.4087 1.3919 2.4790 1.9738 17.7958 0.0000 3.0435 1.3687 0.0188 3.6446 1.9575 1.1116 1.3043 1.3317 0.4328 25.4945 68.2179 17.5402 27.3869 0.9870 25.7644 2.3448 32.7539 8.9373 32.1603 1.6794 0.3705 1.8924 13.6509 3.9708 0.4460 3.3208 0.9674 1.0583 1.0251 9.8018 0.1967 8.6380 0.2710 16.3949 2.5915 4.2108 2.6356 0.2212 2.6544 4.3128 0.2007 7.4271 4.7819 3.6274 2.6471 5.7372 4.9382 3.6754 7.9410 3.4293 1.0862 6.7415 0.1750 5.8253 5.4360 0.2899 7.2782 0.5348 5.2192 4.8674 11.9433 13.0131 13.9405 7.0204 16.9380 18.3236 2.7949 0.7978 1.5056 7.4325 3.5882 13.2153 0.9440 12.3260 50.7652 19.8605 16.3112 1.9904 19.6281 1.7957 4.9646 10.0696 18.7103 5.4073 18.1346 10.4151 12.3227 38.4636 52.5143 38.9760
temp: 298.150 k
press: 1.00000 atm
elementType: 6 6 6 6 6 6 6 6 6 6 6 6 6 6 6 6 6 6 6 6 6 6 6 6 6 1 1 1 1 1 1 1 1 1 1 1 1 1 1 1 1
symmnumber: 1
zpe: 851348.6 jmol-1
zpe.correction: 0.324262 hartree
zpe.thermalcorrener: 0.341922 hartree
zpe.thermalcorrenthalpy: 0.342866 hartree
zpe.thermalcorrgfe: 0.278625 hartree
zpe.sumelectzpe: -960.706440 hartree
zpe.sumelectthermal: -960.688779 hartree
zpe.sumelectthermalent: -960.687835 hartree
zpe.sumelectthermalfe: -960.752076 hartree
dipole: 0.6871 -0.3478 0.0059
dipole: 0.7702
quadrupole: -118.4781 -121.6105 -154.3734
quadrupole: -2.1792 0.0266 -0.0066
quadrupole: 13.0093 9.8768 -22.8861 -2.1792 0.0266 -0.0066
hfenergy: -961.0307012 hartree
pointgroup: C01 [X(C25H16)]
dipole: 0.2655801 -0.1458376 0.003145 debye
polarizability: 473.3640026|24.2276425|363.0581857|-0.9169152|-2.4225468|103.4563915 unknown
InChI: InChI=1S/C25H16/c1-15-9-11-19-22(13-15)20-8-4-6-16-10-12-21-18-7-3-2-5-17(18)14-23(19)25(21)24(16)20/h2-14H,1H3
charge 0 multiplicity 1
41 atoms
C  -0.502989 0.515745 -0.005274
C  0.557425 1.502106 -0.016371
C  -0.16891 -0.900766 0.006678
C  1.945235 1.108689 -0.015633
C  -1.878837 0.934232 -0.005913
C  1.249765 -1.311319 0.007343
C  2.291793 -0.327268 -0.003265
C  0.221085 2.907092 -0.028304
C  -2.945252 -0.054536 0.00537
C  -1.212513 -1.835137 0.017559
C  -2.588457 -1.454142 0.017194
C  -2.170821 2.346028 -0.017925
C  -1.16415 3.294129 -0.02877
C  2.935039 2.121274 -0.026857
C  3.650307 -0.76352 -0.001802
C  1.626054 -2.687369 0.018413
C  1.25253 3.889188 -0.039332
C  4.012471 -2.12174 0.010164
C  2.597218 3.495553 -0.038609
C  -4.337612 0.283561 0.005511
C  2.966634 -3.088528 0.019836
C  -3.620915 -2.450507 0.028554
C  -5.32691 -0.705111 0.016738
C  -4.968034 -2.088324 0.028402
C  5.466461 -2.556662 0.014523
H  -0.997599 -2.907824 0.027098
H  -3.21093 2.682464 -0.01855
H  -1.408665 4.362652 -0.038008
H  3.994792 1.854002 -0.026589
H  4.455552 -0.023285 -0.010084
H  0.855809 -3.46309 0.025667
H  0.979376 4.950554 -0.048384
H  3.393264 4.247706 -0.047091
H  -4.648399 1.332298 -0.003321
H  3.21653 -4.156385 0.028223
H  -3.33056 -3.507849 0.037454
H  -6.384377 -0.41867 0.016557
H  -5.749921 -2.855265 0.037155
H  5.707009 -3.141134 0.922837
H  5.694642 -3.202075 -0.85462
H  6.150259 -1.691369 -0.019375
